(3E)-4-(2,3,6-trimethylphenyl)-3-buten-2-one

Normal alkane RI, polar column, custom temperature program

Data compiled by: NIST Mass Spectrometry Data Center, William E. Wallace, director

Column type Capillary
Active phase Carbowax 20M
Column length (m)
Carrier gas
Substrate
Column diameter (mm)
Phase thickness (μm)
Program not specified
I 2102.
ReferenceAcree and Arn, 2004
Comment MSDC-RI

References

Acree and Arn, 2004
Acree, T.; Arn, H., Flavornet, 2004, retrieved from http://www.flavornet.org/. [all data]