4,5-Bis(nitratomethyl)furoxan

Gas phase thermochemistry data

Data compiled by: Hussein Y. Afeefy, Joel F. Liebman, and Stephen E. Stein

Quantity Value Units Method Reference Comment
Δfgas21. ± 1.kJ/molCcbPepekin, Matyushin, et al., 1975

Condensed phase thermochemistry data

Data compiled by: Hussein Y. Afeefy, Joel F. Liebman, and Stephen E. Stein

Quantity Value Units Method Reference Comment
Δfliquid-43.1 ± 0.4kJ/molCcbPepekin, Matyushin, et al., 1975
Quantity Value Units Method Reference Comment
Δcliquid-2102. ± 0.4kJ/molCcbPepekin, Matyushin, et al., 1975

References

Pepekin, Matyushin, et al., 1975
Pepekin, V.I.; Matyushin, Yu.N.; Nikolaeva, A.D.; Kirsanov, A.P.; Platonova, L.V.; Lebedev, Yu.A., Dissociation energy of N = O bond in dimethylolfuroxan dinitrate, Bull. Acad. Sci. USSR, Div. Chem. Sci., 1975, 1752-1753. [all data]