Naphthalene, 1,2-dimethyl-

Lee's RI, non-polar column, temperature ramp

Data compiled by: NIST Mass Spectrometry Data Center, William E. Wallace, director

Column type CapillaryCapillaryCapillaryCapillaryCapillary
Active phase DB-5MS5 % Phenyl methyl siloxaneDB-5MSPTE-5PTE-5
Column length (m) 30. 30.30.30.
Carrier gas
Substrate
Column diameter (mm) 0.25 0.250.250.25
Phase thickness (μm) 0.25 0.50.250.25
Tstart (C) 50.50.40.60.60.
Tend (C) 300.250.310.300.300.
Heat rate (K/min) 6.2.10.8.8.
Initial hold (min) 2. 1.1.51.5
Final hold (min) 16.  12.512.5
I 248.92236.49249.53246.56247.14
ReferenceSun, Zhou, et al., 2008Skrbic and Onjia, 2006Chen, Keeran, et al., 2002Wang, Jia, et al., 2000Wang, Jia, et al., 2000
Comment MSDC-RI MSDC-RI MSDC-RI MSDC-RI MSDC-RI
Column type CapillaryCapillaryCapillaryCapillaryCapillary
Active phase HP-5SE-52DB-5DB-5CP Sil 8 CB
Column length (m) 30.30.25.30.50.
Carrier gas   HeHeHe
Substrate
Column diameter (mm) 0.250.300.30.320.25
Phase thickness (μm) 0.25  0.250.25
Tstart (C) 50.40.60.50.80.
Tend (C) 280.250.270.300.300.
Heat rate (K/min) 4.4.5.6.4.
Initial hold (min) 2. 2.2.
Final hold (min) 20.
I 249.02248.47248.24249.04248.7
ReferencePiao, Chu, et al., 1999Wang, Peng, et al., 1997Williams and Horne, 1995Wang, Fingas, et al., 1994Bundt, Herbel, et al., 1991
Comment MSDC-RI MSDC-RI MSDC-RI MSDC-RI MSDC-RI
Column type CapillaryCapillaryCapillary
Active phase DB-5SE-52SE-52
Column length (m) 30.20.12.
Carrier gas HeH2He
Substrate
Column diameter (mm) 0.260.300.3
Phase thickness (μm) 0.250.250.34
Tstart (C) 50.40.50.
Tend (C) 300.265.250.
Heat rate (K/min) 6.4.2.
Initial hold (min) 4.2.
Final hold (min) 20.
I 249.67248.50246.49
ReferenceRostad and Pereira, 1986Vassilaros, Kong, et al., 1982Lee, Vassilaros, et al., 1979
Comment MSDC-RI MSDC-RI MSDC-RI

Gas phase thermochemistry data

Data compiled by: Glushko Thermocenter, Russian Academy of Sciences, Moscow

Constant pressure heat capacity of gas

Cp,gas (cal/mol*K) Temperature (K) Reference Comment
9.8750.Thermodynamics Research Center, 1997p=1 bar.
17.0100.
23.9150.
30.81200.
41.32273.15
44.93298.15
45.20300.
58.80400.
70.32500.
79.76600.
87.45700.
93.83800.
99.19900.
103.71000.
108.1100.
111.1200.
114.1300.
116.1400.
118.1500.

Phase change data

Data compiled as indicated in comments:
BS - Robert L. Brown and Stephen E. Stein
TRC - Thermodynamics Research Center, NIST Boulder Laboratories, Chris Muzny director

Quantity Value Units Method Reference Comment
Tboil539.7KN/AWeast and Grasselli, 1989BS
Tboil541.7KN/AKruber and Oberkobusch, 1951Uncertainty assigned by TRC = 2. K; TRC
Tboil498.KN/AReppe, Schlichting, et al., 1948Uncertainty assigned by TRC = 30. K; TRC
Tboil539.KN/ABailey, Bryant, et al., 1947Uncertainty assigned by TRC = 6. K; TRC
Quantity Value Units Method Reference Comment
Tfus270.15KN/ALuther and Riechel, 1950Uncertainty assigned by TRC = 0.7 K; TRC

In addition to the Thermodynamics Research Center (TRC) data available from this site, much more physical and chemical property data is available from the following TRC products:

Kovats' RI, non-polar column, isothermal

View large format table.

Column type Active phase Temperature (C) I Reference Comment
CapillarySqualane120.1420.2Gerasimenko and Nabivach, 1997Column length: 50. m
CapillaryOV-1150.1447.Zhang, Chen, et al., 199725. m/0.2 mm/0.33 μm, N2
CapillaryOV-1150.1448.Zhang, Chen, et al., 199725. m/0.2 mm/0.33 μm, N2
CapillaryOV-1150.1447.Zhang, Chen, et al., 199725. m/0.2 mm/0.33 μm, N2
CapillaryOV-1160.1456.Zhang, Chen, et al., 199725. m/0.2 mm/0.33 μm, N2
CapillarySE-30130.1430.Bredael, 1982Column length: 100. m; Column diameter: 0.5 mm
CapillarySE-30150.1447.Bredael, 1982Column length: 100. m; Column diameter: 0.5 mm
CapillaryOV-101140.1439.7Gerasimenko, Kirilenko, et al., 1981N2; Column length: 50. m; Column diameter: 0.3 mm
CapillaryOV-101160.1455.1Gerasimenko, Kirilenko, et al., 1981N2; Column length: 50. m; Column diameter: 0.3 mm
CapillaryOV-1130.1432.Engewald, Wennrich, et al., 1979Column length: 50. m; Column diameter: 0.23 mm

Van Den Dool and Kratz RI, non-polar column, temperature ramp

View large format table.

Column type Active phase I Reference Comment
CapillaryDB-51452.2Song, Lai, et al., 200330. m/0.25 mm/0.25 μm, He, 4. K/min; Tstart: 40. C; Tend: 310. C
CapillaryDB-51451.1Song, Lai, et al., 200330. m/0.25 mm/0.25 μm, He, 40. C @ 5. min, 4. K/min; Tend: 310. C
CapillaryDB-51439.6Song, Lai, et al., 200330. m/0.25 mm/0.25 μm, He, 2. K/min; Tstart: 40. C; Tend: 310. C
CapillaryDB-51452.2Song, Lai, et al., 200330. m/0.25 mm/0.25 μm, He, 4. K/min; Tstart: 40. C; Tend: 310. C
CapillaryDB-51459.1Song, Lai, et al., 200330. m/0.25 mm/0.25 μm, He, 6. K/min; Tstart: 40. C; Tend: 310. C
CapillaryDB-51439.6Lai and Song, 199530. m/0.25 mm/0.25 μm, He, 2. K/min; Tstart: 40. C; Tend: 310. C
CapillaryDB-51452.2Lai and Song, 199530. m/0.25 mm/0.25 μm, He, 4. K/min; Tstart: 40. C; Tend: 310. C
CapillaryDB-51459.1Lai and Song, 199530. m/0.25 mm/0.25 μm, He, 6. K/min; Tstart: 40. C; Tend: 310. C
CapillaryDB-51452.2Lai and Song, 199530. m/0.25 mm/0.25 μm, He, 4. K/min; Tstart: 40. C; Tend: 310. C
CapillaryDB-51451.1Lai and Song, 199530. m/0.25 mm/0.25 μm, He, 40. C @ 5. min, 4. K/min; Tend: 310. C
CapillaryDB-51462.Rostad and Pereira, 198630. m/0.26 mm/0.25 μm, He, 50. C @ 4. min, 6. K/min, 300. C @ 20. min

Van Den Dool and Kratz RI, non-polar column, custom temperature program

View large format table.

Column type Active phase I Reference Comment
CapillaryHP-51450.6Sandercock and du Pasquier, 200330. m/0.25 mm/0.25 μm, He; Program: 40C(3min) => 4C/min => 208C => 25C/min => 290C(5min)
CapillaryOV-1011439.Yasuhara, Shiraishi, et al., 199715. m/0.25 mm/0.25 μm, He; Program: 50C(2min) => (20C/min) => 120C => (7C/min) => 310C(10min)

Van Den Dool and Kratz RI, polar column, temperature ramp

View large format table.

Column type Active phase I Reference Comment
CapillarySupelcowax-102072.Chung, Yung, et al., 200260. m/0.25 mm/0.25 μm, He, 35. C @ 5. min, 2. K/min, 195. C @ 90. min
CapillarySupelcowax-102072.Chung, Yung, et al., 200160. m/0.25 mm/0.25 μm, He, 35. C @ 5. min, 2. K/min, 195. C @ 90. min
CapillarySupelcowax-102073.Chung, 199960. m/0.25 mm/0.25 μm, He, 35. C @ 5. min, 2. K/min, 195. C @ 90. min

Normal alkane RI, non-polar column, isothermal

View large format table.

Column type Active phase Temperature (C) I Reference Comment
CapillaryOV-101120.1440.Nabivach and Gerasimenko, 1996
PackedPolydimethyl siloxane147.1444.Ferrand, 1962

Normal alkane RI, non-polar column, temperature ramp

View large format table.

Column type Active phase I Reference Comment
CapillaryUltra-11433.Elizalde-González, Hutfliess, et al., 199650. m/0.2 mm/0.33 μm, H2, 3. K/min, 300. C @ 35. min; Tstart: 60. C

Normal alkane RI, non-polar column, custom temperature program

View large format table.

Column type Active phase I Reference Comment
CapillaryOV-11432.Dimov, Osman, et al., 1994Program: not specified
CapillaryOV-1, SE-30, Methyl silicone, SP-2100, OV-101, DB-1, etc.1432.Waggott and Davies, 1984Hydrogen; Column length: 50. m; Column diameter: 0.32 mm; Program: not specified

Lee's RI, non-polar column, custom temperature program

View large format table.

Column type Active phase I Reference Comment
CapillaryDB-5247.3Fuentes, Font, et al., 2007Column length: 60. m; Program: not specified
CapillaryUltra-1246.5Sremac, Skrbic, et al., 200550. m/0.32 mm/0.50 μm, Nitrogen; Program: 40-100 0C 3-15 0C/min -> 290 0C
CapillaryHP-5249.7Sandercock and du Pasquier, 200330. m/0.25 mm/0.25 μm, He; Program: 40C(3min) => 4C/min => 208C => 25C/min => 290C(5min)
CapillarySE-52246.49Wang, Peng, et al., 1997Column length: 30. m; Column diameter: 0.30 mm; Program: not specified
CapillaryDB-5248.6Paschke, Herbel, et al., 199230. m/0.25 mm/0.25 μm, He; Program: 60 0C (3 min) 10 0C/min -> 100 0C (3 min) 5 0C/min -> 300 0C
CapillaryCP Sil 8 CB248.8Bundt, Herbel, et al., 199150. m/0.25 mm/0.25 μm, He; Program: not specified
CapillaryCP Sil 8 CB248.8Bundt, Herbel, et al., 199150. m/0.25 mm/0.25 μm, He; Program: not specified

References

Sun, Zhou, et al., 2008
Sun, P.; Zhou, Q.; Li, G.; Wang, X.; Zhao, Y.; Cao, L., fingerprint analysis of polycyclic aromatic hydrocarbons in crude oil by internal standard method, J. Instrumental Anal., 2008, 27, 4, 344-348. [all data]

Skrbic and Onjia, 2006
Skrbic, B.; Onjia, A., Prediction of Lee Retention Indices of Polycyclic Aromatic Hydrocarbons by Artificial Neural Networks, J. Chromatorg. A, 2006, 1108, 2, 279-284, https://doi.org/10.1016/j.chroma.2006.01.080 . [all data]

Chen, Keeran, et al., 2002
Chen, P.H.; Keeran, W.S.; Van Ausdale, W.A.; Schindler, D.R.; Roberts, D.W., Application of Lee retention indices to the confirmation of tentatively identified compounds from GC/MS analysis of environmental samples, Technical paper, Analytical Services Division, Environmental ScienceEngineering, Inc, PO Box 1703, Gainesville, FL 32602, 2002, 11. [all data]

Wang, Jia, et al., 2000
Wang, J.; Jia, C.R.; Wong, C.K.; Wong, P.K., Characterization of polycyclic aromatic hydrocarbons created in lubricating oils, Water Air Soil Poll., 2000, 120, 3/4, 381-396, https://doi.org/10.1023/A:1005251618062 . [all data]

Piao, Chu, et al., 1999
Piao, M.; Chu, S.; Zheng, M.; Xu, X., Characterization of the combustion products of polyethylene, Chemosphere, 1999, 39, 9, 1497-1512, https://doi.org/10.1016/S0045-6535(99)00054-5 . [all data]

Wang, Peng, et al., 1997
Wang, Y.; Peng, P.; Cui, S.; Zhang, Y., Identification of PAH in the Suzhou River bed sediments by GC/MS and PAH retention index system, J. Nanjing Norm. Univ. (Nat. Sci.), 1997, 20, 2, 47-68. [all data]

Williams and Horne, 1995
Williams, P.T.; Horne, P.A., Analysis of aromatic hydrocarbons in pyrolytic oil derived from biomass, J. Anal. Appl. Pyrolysis, 1995, 31, 15-37, https://doi.org/10.1016/0165-2370(94)00814-H . [all data]

Wang, Fingas, et al., 1994
Wang, Z.; Fingas, M.; Li, K., Fractionation of a light crude oil and identification and quantitation of aliphatic, aromatic, and biomarker comopunds by GC-FID and GC-MS, Part II, J. Chromatogr. Sci., 1994, 32, 9, 367-382, https://doi.org/10.1093/chromsci/32.9.367 . [all data]

Bundt, Herbel, et al., 1991
Bundt, J.; Herbel, W.; Steinhart, H.; Franke, S.; Francke, W., Structure-type separation of diesel fuels by solid phase extraction and identification of the two- and three-ring aromatics by capillary GC-mass spectrometry, J. Hi. Res. Chromatogr., 1991, 14, 2, 91-98, https://doi.org/10.1002/jhrc.1240140205 . [all data]

Rostad and Pereira, 1986
Rostad, C.E.; Pereira, W.E., Kovats and Lee retention indices determined by gas chromatography/mass spectrometry for organic compounds of environmental interest, J. Hi. Res. Chromatogr. Chromatogr. Comm., 1986, 9, 6, 328-334, https://doi.org/10.1002/jhrc.1240090603 . [all data]

Vassilaros, Kong, et al., 1982
Vassilaros, D.L.; Kong, R.C.; Later, D.W.; Lee, M.L., Linear retention index system for polycyclic aromatic compounds. Critical evaluation and additional indices, J. Chromatogr., 1982, 252, 1-20, https://doi.org/10.1016/S0021-9673(01)88394-1 . [all data]

Lee, Vassilaros, et al., 1979
Lee, M.L.; Vassilaros, D.L.; White, C.M.; Novotny, M., Retention Indices for Programmed-Temperature Capillary-Column Gas Chromatography of Polycyclic Aromatic Hydrocarbons, Anal. Chem., 1979, 51, 6, 768-773, https://doi.org/10.1021/ac50042a043 . [all data]