2,4,6-Octatriene, 3,4-dimethyl-

Normal alkane RI, non-polar column, temperature ramp

View large format table.

Column type Active phase I Reference Comment
CapillaryDB-5MS1132.Fernando and Grün, 200160. m/0.25 mm/0.25 μm, He, 35. C @ 5. min, 3. K/min; Tend: 250. C

Normal alkane RI, non-polar column, custom temperature program

View large format table.

Column type Active phase I Reference Comment
CapillaryVF-5MS1110.Xie, Sun, et al., 200630. m/0.25 mm/0.25 μm, He; Program: 40C(1min) => 15C/min => 100C => 4C/min => 250C (1min)

References

Fernando and Grün, 2001
Fernando, L.N.; Grün, I.U., Headspace-SPME analysis of volatiles of the ridge gourd (Luffa acutangula) and bitter gourd (Momordica charantia) flowers, Flavour Fragr. J., 2001, 16, 4, 289-293, https://doi.org/10.1002/ffj.999 . [all data]

Xie, Sun, et al., 2006
Xie, J.; Sun, B.; Yu, M., Constituents of top fragrance from fresh flowers of Robinia Pseudoacacia L. occurring in China, Flavour Fragr. J., 2006, 21, 5, 798-800, https://doi.org/10.1002/ffj.1720 . [all data]