Ethyl 2-thiopheneacetate

Phase change data

Data compiled by: William E. Acree, Jr., James S. Chickos

Quantity Value Units Method Reference Comment
Δvap61.8 ± 1.3kJ/molCRibeiro da Silva and Santos, 2009

References

Ribeiro da Silva and Santos, 2009
Ribeiro da Silva, Manuel A.V.; Santos, Ana Filipa L.O.M., Calorimetric study of methyl and ethyl 2-thiophenecarboxylates and ethyl 2- and 3-thiopheneacetates, The Journal of Chemical Thermodynamics, 2009, 41, 8, 926-931, https://doi.org/10.1016/j.jct.2009.03.007 . [all data]