Thiazole, 4-ethyl-5-propyl-

Kovats' RI, non-polar column, isothermal

Data compiled by: NIST Mass Spectrometry Data Center, William E. Wallace, director

Column type Capillary
Active phase OV-101
Column length (m) 50.
Carrier gas He
Substrate
Column diameter (mm) 0.30
Phase thickness (μm) 0.4
Temperature (C) 110.
I 1175.
ReferenceGolovnya, Zhuravleva, et al., 1991
Comment MSDC-RI

References

Golovnya, Zhuravleva, et al., 1991
Golovnya, R.V.; Zhuravleva, I.L.; Yakush, E.V.; Schenderjuk, V.V., Retentions of alkyloxazoles and alkythiazoles and their prediction based on non-linear additivity concepts in gas chromatography, J. Chromatogr., 1991, 552, 1-12, https://doi.org/10.1016/S0021-9673(01)95918-7 . [all data]