2,3-Dimethylbenzonitrile

Phase change data

Data compiled by: Thermodynamics Research Center, NIST Boulder Laboratories, Chris Muzny director

Quantity Value Units Method Reference Comment
Tfus289.6KN/ABirch, Dean, et al., 1949Uncertainty assigned by TRC = 2. K

In addition to the Thermodynamics Research Center (TRC) data available from this site, much more physical and chemical property data is available from the following TRC products:

References

Birch, Dean, et al., 1949
Birch, S.F.; Dean, R.A.; Fidler, F.A.; Lowry, R.A., The preparation of the c(10) monocyclic aromatic hydrocarbons, J. Am. Chem. Soc., 1949, 71, 1362. [all data]