(Z)-3-Phenylacrylaldehyde

Normal alkane RI, polar column, temperature ramp

Data compiled by: NIST Mass Spectrometry Data Center, William E. Wallace, director

Column type CapillaryCapillary
Active phase PEG-20MSupelcowax-10
Column length (m) 60.60.
Carrier gas  He
Substrate
Column diameter (mm) 0.250.25
Phase thickness (μm)  0.25
Tstart (C) 70.40.
Tend (C) 220.200.
Heat rate (K/min) 3.3.
Initial hold (min)  3.
Final hold (min)  30.
I 1884.1888.
ReferenceAwano, Ichikawa, et al., 1997Wong and Lai, 1996
Comment MSDC-RI MSDC-RI

References

Awano, Ichikawa, et al., 1997
Awano, K.; Ichikawa, Y.; Tokuda, K.; Kuraoka, M., Volatile components of the flowers of two Calanthe species, Flavour Fragr. J., 1997, 12, 5, 327-330, https://doi.org/10.1002/(SICI)1099-1026(199709/10)12:5<327::AID-FFJ661>3.0.CO;2-M . [all data]

Wong and Lai, 1996
Wong, K.C.; Lai, F.Y., Volatile constituents from the fruits of four Syzygium species grown in Malaysia, Flavour Fragr. J., 1996, 11, 1, 61-66, https://doi.org/10.1002/(SICI)1099-1026(199601)11:1<61::AID-FFJ539>3.0.CO;2-1 . [all data]