Naphthalene, 1,5-dimethyl-

Normal alkane RI, non-polar column, temperature ramp

Data compiled by: NIST Mass Spectrometry Data Center, William E. Wallace, director

Column type Capillary
Active phase Ultra-1
Column length (m) 50.
Carrier gas H2
Substrate
Column diameter (mm) 0.2
Phase thickness (μm) 0.33
Tstart (C) 60.
Tend (C) 300.
Heat rate (K/min) 3.
Initial hold (min)
Final hold (min) 35.
I 1420.
ReferenceElizalde-González, Hutfliess, et al., 1996
Comment MSDC-RI

Gas phase thermochemistry data

Data compiled by: Glushko Thermocenter, Russian Academy of Sciences, Moscow

Constant pressure heat capacity of gas

Cp,gas (J/mol*K) Temperature (K) Reference Comment
41.650.Thermodynamics Research Center, 1997p=1 bar.
71.9100.
101.1150.
130.4200.
174.3273.15
189.3298.15
190.4300.
246.7400.
294.6500.
333.7600.
365.9700.
392.5800.
414.9900.
433.81000.
450.1100.
464.1200.
475.1300.
486.1400.
494.1500.

Phase change data

Data compiled as indicated in comments:
BS - Robert L. Brown and Stephen E. Stein
TRC - Thermodynamics Research Center, NIST Boulder Laboratories, Chris Muzny director
AC - William E. Acree, Jr., James S. Chickos

Quantity Value Units Method Reference Comment
Tboil538.2KN/AWeast and Grasselli, 1989BS
Tboil542.3KN/AKruber and Oberkobusch, 1951Uncertainty assigned by TRC = 2. K; TRC
Tboil538.KN/ABailey, Bryant, et al., 1947Uncertainty assigned by TRC = 6. K; TRC
Quantity Value Units Method Reference Comment
Tfus351.KN/AKotula and Rabczuk, 1985Uncertainty assigned by TRC = 2. K; TRC
Tfus354.KN/ACocker, Cross, et al., 1953Uncertainty assigned by TRC = 4. K; TRC
Tfus355.15KN/ALuther and Riechel, 1950Uncertainty assigned by TRC = 0.5 K; TRC

Enthalpy of vaporization

ΔvapH (kcal/mol) Temperature (K) Method Reference Comment
15.3398.GCLei, Chankalal, et al., 2002Based on data from 323. - 473. K.; AC

Enthalpy of fusion

ΔfusH (kcal/mol) Temperature (K) Method Reference Comment
4.8355.2DSCCheon and Kim, 2007AC

In addition to the Thermodynamics Research Center (TRC) data available from this site, much more physical and chemical property data is available from the following TRC products:

References

Elizalde-González, Hutfliess, et al., 1996
Elizalde-González, M.P.; Hutfliess, M.; Hedden, K., Retention index system, adsorption characteristics, and sructure correlations of polycyclic aromatic hydrocarbons in fuels, J. Hi. Res. Chromatogr., 1996, 19, 6, 345-352, https://doi.org/10.1002/jhrc.1240190608 . [all data]