ClF3+

Vibrational and/or electronic energy levels

Data compiled by: Marilyn E. Jacox

State:   F

 Energy
 (cm-1
 Med.   Transition   λmin
 (nm)
 λmax
 (nm)

References

To = 33640 ± 900 gas DeKock, Higginson, et al., 1972

State:   E

 Energy
 (cm-1
 Med.   Transition   λmin
 (nm)
 λmax
 (nm)

Tx = 27590 ± 480 gas DeKock, Higginson, et al., 1972

State:   D

 Energy
 (cm-1
 Med.   Transition   λmin
 (nm)
 λmax
 (nm)

Tx = 21860 ± 720 gas DeKock, Higginson, et al., 1972

State:   C

 Energy
 (cm-1
 Med.   Transition   λmin
 (nm)
 λmax
 (nm)

Tx = 17590 ± 720 gas DeKock, Higginson, et al., 1972

State:   B

 Energy
 (cm-1
 Med.   Transition   λmin
 (nm)
 λmax
 (nm)

To = 8960 ± 900 gas DeKock, Higginson, et al., 1972

Additional references: Jacox, 1994, page 226

DeKock, Higginson, et al., 1972
DeKock, R.L.; Higginson, B.R.; Lloyd, D.R.; Breeze, A.; Cruickshank, D.W.J.; Armstrong, D.R., Photoelectron spectra of halides. V. Experimental theoretical study of the electronic structures of ClF, ClF3, BrF and BrF3, Mol. Phys., 1972, 24, 1059. [all data]

Jacox, 1994
Jacox, M.E., Vibrational and electronic energy levels of polyatomic transient molecules, American Chemical Society, Washington, DC, 1994, 464. [all data]