disulphur decafluoride

Gas phase thermochemistry data

Quantity Value Units Method Reference Comment
Δfgas-2064.39kJ/molReviewChase, 1998Data last reviewed in December, 1977
Quantity Value Units Method Reference Comment
gas,1 bar396.86J/mol*KReviewChase, 1998Data last reviewed in December, 1977

Gas Phase Heat Capacity (Shomate Equation)

Cp° = A + B*t + C*t2 + D*t3 + E/t2
H° − H°298.15= A*t + B*t2/2 + C*t3/3 + D*t4/4 − E/t + F − H
S° = A*ln(t) + B*t + C*t2/2 + D*t3/3 − E/(2*t2) + G
    Cp = heat capacity (J/mol*K)
    H° = standard enthalpy (kJ/mol)
    S° = standard entropy (J/mol*K)
    t = temperature (K) / 1000.

View plot Requires a JavaScript / HTML 5 canvas capable browser.

View table.

Temperature (K) 298. - 1100.1100. - 6000.
A 134.9336286.2300
B 361.5131-3.816102
C -328.83770.710531
D 104.9460-0.046355
E -3.523154-13.73093
F -2129.832-2192.295
G 446.2403676.6574
H -2064.390-2064.390
ReferenceChase, 1998Chase, 1998
Comment Data last reviewed in December, 1977 Data last reviewed in December, 1977

Phase change data

Data compiled by: William E. Acree, Jr., James S. Chickos

Enthalpy of vaporization

ΔvapH (kJ/mol) Temperature (K) Reference Comment
30.1241.Dykyj, Svoboda, et al., 1999Based on data from 226. - 322. K.
29.6237.Cohen and MacDiarmid, 1962Based on data from 222. - 273. K.

References

Chase, 1998
Chase, M.W., Jr., NIST-JANAF Themochemical Tables, Fourth Edition, J. Phys. Chem. Ref. Data, Monograph 9, 1998, 1-1951. [all data]

Dykyj, Svoboda, et al., 1999
Dykyj, J.; Svoboda, J.; Wilhoit, R.C.; Frenkel, M.L.; Hall, K.R., Vapor Pressure of Chemicals: Part A. Vapor Pressure and Antoine Constants for Hydrocarbons and Sulfur, Selenium, Tellurium and Hydrogen Containing Organic Compounds, Springer, Berlin, 1999, 373. [all data]

Cohen and MacDiarmid, 1962
Cohen, Bernard; MacDiarmid, Alan G., Formation of Pentafluorosulfur Fluorosulfonate and Bispentafluorosulfur Oxide from the Direct Reaction of the Elements, Inorg. Chem., 1962, 1, 4, 754-756, https://doi.org/10.1021/ic50004a008 . [all data]