Cyclopropane, 1,2-difluoro-, trans-

Reaction thermochemistry data

Data compiled by: Hussein Y. Afeefy, Joel F. Liebman, and Stephen E. Stein

Individual Reactions

cis-1,2-Difluorocyclopropane = Cyclopropane, 1,2-difluoro-, trans-

By formula: C3H4F2 = C3H4F2

Quantity Value Units Method Reference Comment
Δr-12. ± 0.8kJ/molEqkCraig, Piper, et al., 1971gas phase

References

Craig, Piper, et al., 1971
Craig, N.C.; Piper, L.G.; Wheeler, V.L., Thermodynamics of cis-trans isomerizations. II. The 1-chloro-2-fluoroethylenes, 1,2-difluorocyclopropanes, and related molecules, J. Phys. Chem., 1971, 75, 1453-1460. [all data]