Androstane-3,17-diol, (3β,5α,17β)-

Kovats' RI, non-polar column, isothermal

View large format table.

Column type Active phase Temperature (C) I Reference Comment
PackedOV-1210.2480.Brooks, Thawley, et al., 1971

Van Den Dool and Kratz RI, non-polar column, custom temperature program

View large format table.

Column type Active phase I Reference Comment
CapillaryVF-5MS2634.2Tret'yakov, 200730. m/0.25 mm/0.25 μm, He; Program: Multi-step temperature program; T(initial)=60C; T(final)=270C

References

Brooks, Thawley, et al., 1971
Brooks, C.J.W.; Thawley, A.R.; Rocher, P.; Middleditch, B.S.; Anthony, G.M.; Stillwell, W.G., Characterization of Steroidal Drug Metabolites by Combined Gas Chromatography-Mass Spectrometry, J. Chromatogr. Sci., 1971, 9, 1, 35-43, https://doi.org/10.1093/chromsci/9.1.35 . [all data]

Tret'yakov, 2007
Tret'yakov, K.V., Retention Data. NIST Mass Spectrometry Data Center., NIST Mass Spectrometry Data Center, 2007. [all data]