1,3-dioxane, 2-ethyl-2-methyl-

Phase change data

Data compiled by: Thermodynamics Research Center, NIST Boulder Laboratories, Chris Muzny director

Quantity Value Units Method Reference Comment
Tboil422.KN/ANayanov, Zorin, et al., 1976Uncertainty assigned by TRC = 2. K

In addition to the Thermodynamics Research Center (TRC) data available from this site, much more physical and chemical property data is available from the following TRC products:

References

Nayanov, Zorin, et al., 1976
Nayanov, V.P.; Zorin, V.V.; Zlotskii, S.S.; Rakhmankulov, D.L., Identification of Cyclic Acetates and Isomeric Esters by Gas-Liquid Chromatography, Zh. Prikl. Khim. (Leningrad), 1976, 49, 2350. [all data]