2-Propanol, 1-(1,1-dimethylethoxy)-

Phase change data

Data compiled by: William E. Acree, Jr., James S. Chickos

Enthalpy of vaporization

ΔvapH (kJ/mol) Temperature (K) Method Reference Comment
45.4361.EBBernatová and Wichterle, 2001Based on data from 346. - 420. K.

Van Den Dool and Kratz RI, non-polar column, temperature ramp

View large format table.

Column type Active phase I Reference Comment
CapillaryPetrocol DH861.6Censullo, Jones, et al., 200350. m/0.25 mm/0.5 μm, He, 35. C @ 10. min, 3. K/min, 200. C @ 10. min
CapillaryPetrocol DH862.0Censullo, Jones, et al., 200350. m/0.25 mm/0.5 μm, He, 35. C @ 10. min, 3. K/min, 200. C @ 10. min

References

Bernatová and Wichterle, 2001
Bernatová, Svatoslava; Wichterle, Ivan, Isothermal vapour--liquid equilibrium in the binary tert-butanol or 2,2,4-trimethylpentane+1-tert-butoxy-2-propanol, and in the ternary tert-butanol+2,2,4-trimethylpentane+1-tert-butoxy-2-propanol systems, Fluid Phase Equilibria, 2001, 189, 1-2, 111-118, https://doi.org/10.1016/S0378-3812(01)00574-X . [all data]

Censullo, Jones, et al., 2003
Censullo, A.C.; Jones, D.R.; Wills, M.T., Speciation of the volatile organic compounds (VOCs) in solventborne aerosol coatings by solid phase microextraction-gas chromatography, J. Coat. Technol., 2003, 75, 936, 47-53, https://doi.org/10.1007/BF02697922 . [all data]