Creatine

Condensed phase thermochemistry data

Data compiled as indicated in comments:
ALS - Hussein Y. Afeefy, Joel F. Liebman, and Stephen E. Stein
DH - Eugene S. Domalski and Elizabeth D. Hearing

Quantity Value Units Method Reference Comment
Δfsolid-537.18 ± 0.88kJ/molCcbHuffman, Ellis, et al., 1936Reanalyzed by Cox and Pilcher, 1970, Original value = -541.03 kJ/mol; ALS
Quantity Value Units Method Reference Comment
Δcsolid-2323.1 ± 0.84kJ/molCcbHuffman, Ellis, et al., 1936Reanalyzed by Cox and Pilcher, 1970, Original value = -2322.4 ± 0.84 kJ/mol; ALS
Δcsolid-2325.5kJ/molCcbEmery and Benedict, 1911ALS
Quantity Value Units Method Reference Comment
solid,1 bar189.5J/mol*KN/AHuffman and Borsook, 1932Extrapolation below 90 K, 55.69 J/mol*K.; DH

Constant pressure heat capacity of solid

Cp,solid (J/mol*K) Temperature (K) Reference Comment
184.5323.Satoh and Sogabe, 1941T = 0 to 100°C. Mean value.; DH
171.1296.3Huffman and Borsook, 1932T = 87 to 295 K. Value is unsmoothed experimental datum.; DH

References

Huffman, Ellis, et al., 1936
Huffman, H.M.; Ellis, E.L.; Fox, S.W., Thermal data. VI. The heats of combustion and free energies of seven organic compounds containing nitrogen, J. Am. Chem. Soc., 1936, 58, 1728-1733. [all data]

Cox and Pilcher, 1970
Cox, J.D.; Pilcher, G., Thermochemistry of Organic and Organometallic Compounds, Academic Press, New York, 1970, 1-636. [all data]

Emery and Benedict, 1911
Emery, A.G.; Benedict, F.G., The heat of combustion of compounds of physiological importance, Am. J. Physiol., 1911, 28, 301-307. [all data]

Huffman and Borsook, 1932
Huffman, H.M.; Borsook, H., Thermal data. I. The heat capacities, entropies and free energies of seven organic compounds containing nitrogen, J. Am. Chem. Soc., 1932, 54, 4297-4301. [all data]

Satoh and Sogabe, 1941
Satoh, S.; Sogabe, T., The heat capacities of some organic compounds containing nitrogen and the atomic heat of nitrogen. (3), Sci., Pap. Inst. Phys. Chem. Res. (Tokyo), 1941, 38, 238-245. [all data]