Tritriacontane, 15,19-dimethyl-

Van Den Dool and Kratz RI, non-polar column, temperature ramp

Data compiled by: NIST Mass Spectrometry Data Center, William E. Wallace, director

Column type CapillaryCapillary
Active phase HT-5HT-5
Column length (m) 25.25.
Carrier gas N2N2
Substrate
Column diameter (mm) 0.530.53
Phase thickness (μm) 0.220.22
Tstart (C) 150.150.
Tend (C) 320.320.
Heat rate (K/min) 15.15.
Initial hold (min)
Final hold (min) 20.20.
I 3344.3345.
ReferenceGoh S.H., Ooi K.E., et al., 1993Goh S.H., Ooi K.E., et al., 1993
Comment MSDC-RI MSDC-RI

Normal alkane RI, non-polar column, custom temperature program

View large format table.

Column type Active phase I Reference Comment
CapillaryMethyl Silicone3355.Sullivan, 2002Program: not specified
CapillaryDB-13355.Carlson, Geden, et al., 199930. m/0.32 mm/0.25 μm, He; Program: 60C (2min) => 10C/min => 220C => 3C/min => 310C (12 - 42 min)
CapillaryDexsil 3003343.Lockey, 1981Column length: 15. m; Program: 50 0C 5 0C/min -> 200 0C 2 0C/min -> 340 0C
CapillaryDexsil 3003350.Lockey, 1981Column length: 15. m; Program: 50 0C 5 0C/min -> 200 0C 2 0C/min -> 340 0C

References

Goh S.H., Ooi K.E., et al., 1993
Goh S.H.; Ooi K.E.; Chuah C.H.; Yong H.S.; Khoo S.G.; Ong S.H., Cuticular hydrocarbons from two species of Malaysian Bactrocera fruit flies, Biochem. Syst. Ecol., 1993, 21, 2, 215-226, https://doi.org/10.1016/0305-1978(93)90039-T . [all data]