Ethyl nerolate

Normal alkane RI, non-polar column, temperature ramp

View large format table.

Column type Active phase I Reference Comment
CapillaryHP-5MS1359.Melkani, Dev, et al., 200530. m/0.25 mm/0.25 μm, 50. C @ 10. min, 3. K/min, 250. C @ 5. min

Normal alkane RI, polar column, temperature ramp

View large format table.

Column type Active phase I Reference Comment
CapillarySupelcowax2123.Näf and Velluz, 1998He, 5. K/min; Column length: 60. m; Column diameter: 0.25 mm; Tstart: 80. C; Tend: 240. C

References

Melkani, Dev, et al., 2005
Melkani, A.B.; Dev, V.; Beauchamp, P.S.; Negi, A.; Mehta, S.P.S.; Melkani, K.B., Constituents of the essential oil of a new chemotype of Elsholtzia strobilifera Benth., Biochem. Syst. Ecol., 2005, 33, 4, 419-425, https://doi.org/10.1016/j.bse.2004.10.009 . [all data]

Näf and Velluz, 1998
Näf, R.; Velluz, A., Phenols and lactones in Italo-Mitcham peppermint oil Mentha × piperita L., Flavour Fragr. J., 1998, 13, 3, 203-208, https://doi.org/10.1002/(SICI)1099-1026(199805/06)13:3<203::AID-FFJ725>3.0.CO;2-0 . [all data]