t-HNSO

Vibrational and/or electronic energy levels

Data compiled by: Marilyn E. Jacox

State:   X

Vib.
sym.
 No.   Approximate
 type of mode
 cm-1   Med.   Method   References

a' 2 SO stretch 1382 Ar IR Tchir and Spratley, 1975
3 NS stretch 986 Ar IR Tchir and Spratley, 1975
4 HNS bend 881 Ar IR Tchir and Spratley, 1975
a 6 Torsion 651 Ar IR Tchir and Spratley, 1975

Additional references: Jacox, 1994, page 175; Muller, Nonella, et al., 1984

References

Tchir and Spratley, 1975
Tchir, P.O.; Spratley, R.D., The Photolysis of Matrix Isolated, Can. J. Chem., 1975, 53, 15, 2331, https://doi.org/10.1139/v75-326 . [all data]

Jacox, 1994
Jacox, M.E., Vibrational and electronic energy levels of polyatomic transient molecules, American Chemical Society, Washington, DC, 1994, 464. [all data]

Muller, Nonella, et al., 1984
Muller, R.P.; Nonella, M.; Russegger, P.; Huber, J.R., UV-, VIS- and IR-light-induced isomerization of HSNO in a low-temperature matrix, Chem. Phys., 1984, 87, 3, 351, https://doi.org/10.1016/0301-0104(84)85116-2 . [all data]