1,3,6-Triaza-8-phosphatricyclo[4.3.1.13,8]undecane

Gas phase ion energetics data

Data compiled by: Sharon G. Lias, John E. Bartmess, Joel F. Liebman, John L. Holmes, Rhoda D. Levin, and W. Gary Mallard

Ionization energy determinations

IE (eV) Method Reference Comment
7.35 ± 0.10PECowley, Lattman, et al., 1982Vertical value

References

Cowley, Lattman, et al., 1982
Cowley, A.H.; Lattman, M.; Stricklen, P.M.; Verkade, J.G., UV photoelectron spectroscopic investigation of some polycyclic group 5A compounds and related acyclic species. 1. Free and coordinated aminophosphines and related compounds, Inorg. Chem., 1982, 21, 543. [all data]