1,2,3-Benzenetricarboxylic acid

Condensed phase thermochemistry data

Data compiled by: Hussein Y. Afeefy, Joel F. Liebman, and Stephen E. Stein

Quantity Value Units Method Reference Comment
Δfsolid-1160.4 ± 0.84kJ/molCcbYukhno and Bikkulov, 1971
Quantity Value Units Method Reference Comment
Δcsolid-3238.7 ± 0.84kJ/molCcbYukhno and Bikkulov, 1971Corresponding Δfsolid = -1160.4 kJ/mol (simple calculation by NIST; no Washburn corrections)

References

Yukhno and Bikkulov, 1971
Yukhno, G.F.; Bikkulov, A.Z., Enthalpies of combustion and formation of benzenecarboxylic acids, Russ. J. Phys. Chem. (Engl. Transl.), 1971, 45, 924-925. [all data]