1(3H)-Isobenzofuranone, 6,7-dimethoxy-

Normal alkane RI, non-polar column, temperature ramp

View large format table.

Column type Active phase I Reference Comment
CapillaryUltra-21765.Strömberg, Lundberg, et al., 200025. m/0.2 mm/0.11 μm, He, 6. K/min, 320. C @ 6. min; Tstart: 160. C

Normal alkane RI, non-polar column, custom temperature program

View large format table.

Column type Active phase I Reference Comment
Capillary5 % Phenyl methyl siloxane1768.Grigoriev and Savchuk, 201025. m/0.20 mm/0.33 μm; Program: 50 0C (0.5 min) 99 0C/min -> 100 0C (1 min) 15 0C/min -> 280 0C (20 min)
Capillary5 % Phenyl methyl siloxane1769.Grigoriev and Savchuk, 201025. m/0.20 mm/0.33 μm; Program: 50 0C (0.5 min) 99 0C/min -> 100 0C (1 min) 15 0C/min -> 280 0C (20 min)

References

Strömberg, Lundberg, et al., 2000
Strömberg, L.; Lundberg, L.; Neumann, H.; Bobon, B.; Huizer, H.; van der Stelt, N.W., Heroin impurity profiling. A harmonization study for retrospective comparisons, Forensic Sci. Int., 2000, 114, 2, 67-88, https://doi.org/10.1016/S0379-0738(00)00295-4 . [all data]

Grigoriev and Savchuk, 2010
Grigoriev, A.M.; Savchuk, S.A., Correlation of the parameters of screening libraries of the gas-chromatographic retention data, Rus. J. Anal. Chem. (Engl. Transl.), 2010, 65, 4, 388-397. [all data]