Pyridine,4-trifluoromethyl)-,compound with borane(3)

Gas phase ion energetics data

Data compiled by: Sharon G. Lias, Rhoda D. Levin, and Sherif A. Kafafi

Ionization energy determinations

IE (eV) Method Reference Comment
10.04PEWeiner and Lattman, 1975Vertical value

References

Weiner and Lattman, 1975
Weiner, M.A.; Lattman, M., Ultraviolet photoelectron spectra of 4-substituted pyridineboranes, Inorg. Nucl. Chem. Lett., 1975, 11, 723. [all data]