Aspartic acid

Condensed phase thermochemistry data

Data compiled as indicated in comments:
ALS - Hussein Y. Afeefy, Joel F. Liebman, and Stephen E. Stein
DH - Eugene S. Domalski and Elizabeth D. Hearing

Quantity Value Units Method Reference Comment
Δfsolid-973.32 ± 0.84kJ/molCcbHuffman, Ellis, et al., 1936Reanalyzed by Cox and Pilcher, 1970, Original value = -976.92 kJ/mol; ALS
Quantity Value Units Method Reference Comment
Δcsolid-1601.1 ± 0.79kJ/molCcbHuffman, Ellis, et al., 1936Reanalyzed by Cox and Pilcher, 1970, Original value = -1600. ± 0.79 kJ/mol; ALS
Δcsolid-1604.4kJ/molCcbEmery and Benedict, 1911ALS
Δcsolid-1617.8kJ/molCcbFischer and Wrede, 1904Heat of combustion corrected for pressure; ALS
Δcsolid-1615.6kJ/molCcbLemoult, 1904ALS
Quantity Value Units Method Reference Comment
solid,1 bar170.12J/mol*KN/AHutchens, Cole, et al., 1963DH
solid,1 bar173.6J/mol*KN/AHuffman and Borsook, 1932Extrapolation below 90 K, 51.09 J/mol*K.; DH

Constant pressure heat capacity of solid

Cp,solid (J/mol*K) Temperature (K) Reference Comment
155.18298.15Hutchens, Cole, et al., 1963T = 10 to 310 K.; DH
152.7293.9Huffman and Borsook, 1932T = 88 to 293 K. Value is unsmoothed experimental datum.; DH

Gas phase ion energetics data

Data evaluated by: Edward P. Hunter and Sharon G. Lias

Quantity Value Units Method Reference Comment
Proton affinity (review)908.9kJ/molN/AHunter and Lias, 1998
Quantity Value Units Method Reference Comment
Gas basicity875.kJ/molN/AHunter and Lias, 1998

References

Huffman, Ellis, et al., 1936
Huffman, H.M.; Ellis, E.L.; Fox, S.W., Thermal data. VI. The heats of combustion and free energies of seven organic compounds containing nitrogen, J. Am. Chem. Soc., 1936, 58, 1728-1733. [all data]

Cox and Pilcher, 1970
Cox, J.D.; Pilcher, G., Thermochemistry of Organic and Organometallic Compounds, Academic Press, New York, 1970, 1-636. [all data]

Emery and Benedict, 1911
Emery, A.G.; Benedict, F.G., The heat of combustion of compounds of physiological importance, Am. J. Physiol., 1911, 28, 301-307. [all data]

Fischer and Wrede, 1904
Fischer, E.; Wrede, F., Uber die Verbrennungswarme einiger organischer Verbindungen, Sitzungsber. Dtsch. Akad. Wiss. Berlin Kl. Math. Phys. Tech., 1904, 687-715. [all data]

Lemoult, 1904
Lemoult, M.P., Remarques sur une serie recenie de determinations calorimetriques, Compt. Rend., 1904, 663-635. [all data]

Hutchens, Cole, et al., 1963
Hutchens, J.O.; Cole, A.G.; Robie, R.A.; Stout, J.W., Heat capacities from 11 to 305 K, entropies, and free energies of formation of L-aspartic acid, L-glutamic acid, and L-glutamine, J. Biol. Chem., 1963, 238, 2407-2412. [all data]

Huffman and Borsook, 1932
Huffman, H.M.; Borsook, H., Thermal data. I. The heat capacities, entropies and free energies of seven organic compounds containing nitrogen, J. Am. Chem. Soc., 1932, 54, 4297-4301. [all data]

Hunter and Lias, 1998
Hunter, E.P.; Lias, S.G., Evaluated Gas Phase Basicities and Proton Affinities of Molecules: An Update, J. Phys. Chem. Ref. Data, 1998, 27, 3, 413-656, https://doi.org/10.1063/1.556018 . [all data]