1,3-Dioxolo[4,5-c]acridin-6(11H)-one, 4,5-dimethoxy-11-methyl-

Van Den Dool and Kratz RI, non-polar column, temperature ramp

View large format table.

Column type Active phase I Reference Comment
CapillaryOptima 53000.Chosson, Vérité, et al., 200325. m/0.25 mm/0.25 μm, He, 3. K/min, 280. C @ 20. min; Tstart: 60. C

References

Chosson, Vérité, et al., 2003
Chosson, E.; Vérité, P.; Blanckaert, A.; Seguin, E.; Litaudon, M.; Sévenet, T., Non polar compounds from the bark of Sarcomelicope follicularis, Biochem. Syst. Ecol., 2003, 31, 10, 1185-1188, https://doi.org/10.1016/S0305-1978(03)00065-6 . [all data]