10b,10c-Diazadicyclopenta[ef,kl]heptalene,3,4,5,8,9,10-hexahydro-

Gas phase ion energetics data

Data compiled by: Sharon G. Lias, Rhoda D. Levin, and Sherif A. Kafafi

Ionization energy determinations

IE (eV) Method Reference Comment
7.72PEFlitsch, Peeters, et al., 1978Vertical value

References

Flitsch, Peeters, et al., 1978
Flitsch, W.; Peeters, H.; Schulten, W.; Rademacher, P., Photoelektronenspektren und Konformation von 1,1'-Bipyrroylen, Tetrahedron, 1978, 34, 2301. [all data]