1,3-Dihydroxy-2-hexylbenzene

Phase change data

Data compiled by: William E. Acree, Jr., James S. Chickos

Enthalpy of vaporization

ΔvapH (kcal/mol) Temperature (K) Method Reference Comment
18.4448.A,GCStephenson and Malanowski, 1987Based on data from 433. - 494. K. See also Kundel, Lille, et al., 1975.

References

Stephenson and Malanowski, 1987
Stephenson, Richard M.; Malanowski, Stanislaw, Handbook of the Thermodynamics of Organic Compounds, 1987, https://doi.org/10.1007/978-94-009-3173-2 . [all data]

Kundel, Lille, et al., 1975
Kundel, H.; Lille, U.; Kaidas, N., Tr. Tallin. Politekh. Inst., 1975, 390, 107. [all data]