11-Hexadecen-1-ol, (Z)-

Kovats' RI, non-polar column, isothermal

View large format table.

Column type Active phase Temperature (C) I Reference Comment
PackedApiezon L210.1830.Nedopekina, Kovalev, et al., 1981N2, Chromatron N-AW-HMDS; Column length: 2.5 m

Van Den Dool and Kratz RI, non-polar column, temperature ramp

View large format table.

Column type Active phase I Reference Comment
CapillaryDB-51874.Marques, McElfresh, et al., 200030. m/0.25 mm/0.25 μm, 100. C @ 1. min, 5. K/min, 275. C @ 3. min

Normal alkane RI, non-polar column, temperature ramp

View large format table.

Column type Active phase I Reference Comment
CapillaryHP-5MS1863.Setzer, Noletto, et al., 200630. m/0.25 mm/0.25 μm, He, 60. C @ 5. min, 3. K/min; Tend: 280. C
CapillaryHP-51871.Naka, van Vang, et al., 2003He, 100. C @ 2. min, 8. K/min, 240. C @ 15. min; Column length: 30. m; Column diameter: 0.25 mm

Phase change data

Data compiled by: William E. Acree, Jr., James S. Chickos

Quantity Value Units Method Reference Comment
Δvap26.60kcal/molCGCOva, Koultek, et al., 2000Based on data from 373. - 413. K. See also Koutek, Hoskovec, et al., 1994.

References

Nedopekina, Kovalev, et al., 1981
Nedopekina, S.F.; Kovalev, B.G.; Kost, A.N., Use of Kovats indices for idetifying sex pheromones, Chem. Nat. Compd. (Engl. Transl.), 1981, 17, 4, 376-380, https://doi.org/10.1007/BF01185272 . [all data]

Marques, McElfresh, et al., 2000
Marques, F.A.; McElfresh, J.S.; Millar, J.G., Kováts retention indexes of monounsaturated C12, C14, and C16 alcohols, acetates and aldehydes commonly found in lepidopteran pheromone blends, J. Braz. Chem. Soc., 2000, 11, 6, 592-599, https://doi.org/10.1590/S0103-50532000000600007 . [all data]

Setzer, Noletto, et al., 2006
Setzer, W.N.; Noletto, J.A.; Lawton, R.O., Chemical composition of the floral essential oil of Randia matudae from Monteverde, Costa Rica, Flavour Fragr. J., 2006, 21, 2, 244-246, https://doi.org/10.1002/ffj.1567 . [all data]

Naka, van Vang, et al., 2003
Naka, H.; van Vang, L.; Inomata, S.-I.; Ando, T.; Kimura, T.; Honda, H.; Tsuchida, K.; Sakurai, H., Sex pheromone of the persimmon fruit moth, Stathmopoda masinissa: identification and laboratory bioassay of (4E, 6Z)-4,6-hexadecadien-1-ol derivatives, J. Chem. Ecol., 2003, 29, 11, 2447-2459, https://doi.org/10.1023/A:1026301800140 . [all data]