2-Octynoic acid

Condensed phase thermochemistry data

Data compiled as indicated in comments:
DRB - Donald R. Burgess, Jr.
ALS - Hussein Y. Afeefy, Joel F. Liebman, and Stephen E. Stein

Quantity Value Units Method Reference Comment
Δfliquid-78.20 ± 0.96kcal/molCcbN/Arecalculated with modern CO2,H2O thermo; estimated uncertainty (NOTE all values in source also have wrong sign); DRB
Δfliquid87.6kcal/molCcbMoureu and Andre, 1914ALS
Quantity Value Units Method Reference Comment
Δcliquid-1084.1kcal/molCcbMoureu and Andre, 1914Corresponding Δfliquid = -78.2 kcal/mol (simple calculation by NIST; no Washburn corrections); ALS

Phase change data

Data compiled as indicated in comments:
BS - Robert L. Brown and Stephen E. Stein
TRC - Thermodynamics Research Center, NIST Boulder Laboratories, Chris Muzny director

Quantity Value Units Method Reference Comment
Tfus276.15KN/AMoureu and Andre, 1914, 2Uncertainty assigned by TRC = 2. K; TRC

Reduced pressure boiling point

Tboil (K) Pressure (atm) Reference Comment
421.70.025Weast and Grasselli, 1989BS

In addition to the Thermodynamics Research Center (TRC) data available from this site, much more physical and chemical property data is available from the following TRC products:

References

Moureu and Andre, 1914
Moureu, C.; Andre, E., Thermochimie des composes acetyleniques, Ann. Chim. Phys., 1914, 1, 113-145. [all data]

Moureu and Andre, 1914, 2
Moureu, C.; Andre, E., Thermochemistry of Acetylenic Compounds, Ann. Chim. (Paris), 1914, 1, 113. [all data]

Weast and Grasselli, 1989
CRC Handbook of Data on Organic Compounds, 2nd Editon, Weast,R.C and Grasselli, J.G., ed(s)., CRC Press, Inc., Boca Raton, FL, 1989, 1. [all data]