1H-1,2,4-Triazole,3-chloro-1,5-dimethyl-

Gas phase ion energetics data

Data compiled by: Sharon G. Lias, Rhoda D. Levin, and Sherif A. Kafafi

Ionization energy determinations

IE (eV) Method Reference Comment
9.4PEGuimon, Pfister-Guillouzo, et al., 1980Vertical value

References

Guimon, Pfister-Guillouzo, et al., 1980
Guimon, C.; Pfister-Guillouzo, G.; Bernardini, A.; Viallefont, P., A photoelectron study (HeI, HeII) of the tautomeric equilibrium of chloro- and bromo-1,2,4-triazoles, Tetrahedron, 1980, 36, 1071. [all data]