2-Azetidinone, 4-phenyl-

Normal alkane RI, non-polar column, temperature ramp

View large format table.

Column type Active phase I Reference Comment
CapillaryHP-5 MS1254.Kim and Chung, 200930. m/0.25 mm/0.25 μm, Helium, 35. C @ 5. min, 2. K/min, 195. C @ 30. min

References

Kim and Chung, 2009
Kim, J.-S.; Chung, H.Y., GC-MS analysis of the volatile components in dried boxthorn (Lycium chimensis) Fruit, J. Korean Soc. Appl. Biol. Chem., 2009, 52, 5, 516-524, https://doi.org/10.3839/jksabc.2009.088 . [all data]