N-Acetylbenzenesulfonamide

Condensed phase thermochemistry data

Data compiled by: Hussein Y. Afeefy, Joel F. Liebman, and Stephen E. Stein

Quantity Value Units Method Reference Comment
Δfsolid-175.0kcal/molCcbPushkareva and Kokoshko, 1946Author's hf298_condensed=-126.6 kcal/mol
Quantity Value Units Method Reference Comment
Δcsolid-1028.7kcal/molCcbPushkareva and Kokoshko, 1946Author's hf298_condensed=-126.6 kcal/mol

References

Pushkareva and Kokoshko, 1946
Pushkareva, Z.V.; Kokoshko, Z.U., On the question of the relation between the structure and bacteriostatic activity of sulphanilamide compounds. I. The resonance energy of some sulphanilamide compounds, Zh. Obshch. Kim., 1946, 16, 1269-1278. [all data]