3-Pentanone, 2-methyl-
- Formula: C6H12O
- Molecular weight: 100.1589
- IUPAC Standard InChIKey: HYTRYEXINDDXJK-UHFFFAOYSA-N
- CAS Registry Number: 565-69-5
- Chemical structure:

Kovats' RI, non-polar column, isothermal

Column type | Active phase | Temperature (C) | I | Reference | Comment |
---|---|---|---|---|---|
Capillary | OV-1 | 333. | 733. | Hu, Lu, et al., 2006 | |
Capillary | OV-1 | 333. | 733. | Hu, Lu, et al., 2006 |

Kovats' RI, non-polar column, temperature ramp

Column type | Active phase | I | Reference | Comment |
---|---|---|---|---|
Capillary | SE-54 | 748. | Rembold, Wallner, et al., 1989 | 30. m/0.25 mm/0.25 μm, He, 0. C @ 12. min, 12. K/min; Tend: 250. C |

Van Den Dool and Kratz RI, non-polar column, temperature ramp

Column type | Active phase | I | Reference | Comment |
---|---|---|---|---|
Capillary | BP-1 | 722. | Bianchini, Tomi, et al., 2003 | 50. m/0.22 mm/0.25 μm, He, 2. K/min, 230. C @ 35. min; Tstart: 60. C |
Capillary | BP-1 | 722. | Bianchini, Tomi, et al., 2003 | 50. m/0.22 mm/0.25 μm, He, 2. K/min, 230. C @ 35. min; Tstart: 60. C |
Capillary | DB-1 | 726.0 | Sun and Stremple, 2003 | 30. m/0.25 mm/0.25 μm, He, 3. K/min; Tstart: 40. C; Tend: 325. C |
Capillary | DB-5 | 747.9 | Xu, van Stee, et al., 2003 | 30. m/0.25 mm/1. μm, He, 2.5 K/min; Tstart: 50. C; Tend: 200. C |
Capillary | BP-1 | 722. | Bianchini, Tomi, et al., 2001 | 50. m/0.22 mm/0.25 μm, He, 2. K/min, 230. C @ 35. min; Tstart: 60. C |

Van Den Dool and Kratz RI, polar column, temperature ramp

Column type | Active phase | I | Reference | Comment |
---|---|---|---|---|
Capillary | BP-20 | 1003. | Bianchini, Tomi, et al., 2003 | 50. m/0.22 mm/0.25 μm, He, 2. K/min, 230. C @ 35. min; Tstart: 60. C |
Capillary | BP-20 | 1003. | Bianchini, Tomi, et al., 2003 | 50. m/0.22 mm/0.25 μm, He, 2. K/min, 230. C @ 35. min; Tstart: 60. C |
Capillary | BP-20 | 1003. | Bianchini, Tomi, et al., 2001 | 50. m/0.22 mm/0.25 μm, He, 2. K/min, 230. C @ 35. min; Tstart: 60. C |

Normal alkane RI, non-polar column, isothermal

Column type | Active phase | Temperature (C) | I | Reference | Comment |
---|---|---|---|---|---|
Capillary | OV-1 | 60. | 732. | Amboni, Junkes, et al., 2002 | |
Capillary | OV-1 | 60. | 732. | Amboni, Junkes, et al., 2002 |

Normal alkane RI, non-polar column, temperature ramp

Column type | Active phase | I | Reference | Comment |
---|---|---|---|---|
Capillary | OV-101 | 737. | Zenkevich, Eliseenkov, et al., 2011 | 25. m/0.20 mm/0.25 μm, Nitrogen, 6. K/min; Tstart: 40. C; Tend: 240. C |
Capillary | HP-5 | 752. | N/A | 30. m/0.32 mm/0.25 μm, Helium, 40. C @ 2. min, 5. K/min, 250. C @ 5. min |

Normal alkane RI, non-polar column, custom temperature program

Column type | Active phase | I | Reference | Comment |
---|---|---|---|---|
Capillary | SLB-5 MS | 742. | Costa, De Fina, et al., 2008 | 30. m/0.25 mm/0.25 μm, Helium; Program: 50 0C 3 0C/min -> 250 0C (1 min) 10 0C/min -> 300 0C (5 min) |
Capillary | SLB-5 MS | 742. | Costa, De Fina, et al., 2008 | 30. m/0.25 mm/0.25 μm, Helium; Program: not specified |
Capillary | Methyl Silicone | 733. | Feng and Mu, 2007 | Program: not specified |
Capillary | Methyl Silicone | 734. | Blunden, Aneja, et al., 2005 | 60. m/0.32 mm/1.0 μm, Helium; Program: -50 0C (2 min) 8 0C/min -> 200 0C (7.75 min) 25 0C -> 225 0C (8 min) |
Capillary | Polydimethyl siloxane | 732. | Junkes, Castanho, et al., 2003 | Program: not specified |
Capillary | Polydimethyl siloxane | 732. | Junkes, Castanho, et al., 2003 | Program: not specified |
Capillary | Methyl Silicone | 733. | Estrada and Gutierrez, 1999 | Program: not specified |
Capillary | Methyl Silicone | 733. | Estrada and Gutierrez, 1999 | Program: not specified |
Capillary | DB-1 | 732. | Ciccioli, Cecinato, et al., 1994 | 60. m/0.32 mm/0.25 μm; Program: not specified |
Capillary | DB-1 | 732. | Ciccioli, Brancaleoni, et al., 1993 | 60. m/0.32 mm/0.25 μm; Program: 3 min at 5 C; 5 - 50 C at 3 deg/min; 50 - 220 C at 5 deg/min |

Normal alkane RI, polar column, temperature ramp

Column type | Active phase | I | Reference | Comment |
---|---|---|---|---|
Capillary | ZB-Wax | 1005. | N/A | 30. m/0.32 mm/0.25 μm, Helium, 40. C @ 2. min, 5. K/min, 250. C @ 5. min |
Capillary | Supelcowax-10 | 989. | Girard and Lau, 1995 | 90. m/0.25 mm/0.25 μm, He, 35. C @ 20. min, 2. K/min, 220. C @ 30. min |
Capillary | Carbowax 20M | 972. | Kawakami and Kobayashi, 1991 | He, 60. C @ 4. min, 2. K/min; Column length: 50. m; Column diameter: 0.25 mm; Tend: 180. C |

Normal alkane RI, polar column, custom temperature program

Column type | Active phase | I | Reference | Comment |
---|---|---|---|---|
Capillary | SOLGel-Wax | 997. | Johanningsmeier and McFeeters, 2011 | 30. m/0.25 mm/0.25 μm, Helium; Program: 40 0C (2 min) 5 0C/min -> 140 0C 10 0C/min -> 250 0C (3 min) |
Capillary | SOLGel-Wax | 1003. | Johanningsmeier and McFeeters, 2011 | 30. m/0.25 mm/0.25 μm, Helium; Program: not specified |
Capillary | HP-Innowax | 1007. | Cajka, Riddellova, et al., 2010 | 30. m/0.25 mm/0.25 μm, Helium; Program: 45 0C (1 min) 5 oC/min -> 170 0C 10 0C/min -> 260 0C (1 min) |
Capillary | DB-Wax | 1000. | Peng, Yang, et al., 1991 | Program: not specified |

Gas phase thermochemistry data

Data compiled by: Hussein Y. Afeefy, Joel F. Liebman, and Stephen E. Stein
Quantity | Value | Units | Method | Reference | Comment |
---|---|---|---|---|---|
ΔfH°gas | -286.1 ± 0.9 | kJ/mol | Ccr | Seller, 1970 |

Phase change data

Data compiled as indicated in comments:
BS - Robert L. Brown and Stephen E. Stein
TRC - Thermodynamics Research Center, NIST Boulder Laboratories, Chris Muzny director
AC - William E. Acree, Jr., James S. Chickos
ALS - Hussein Y. Afeefy, Joel F. Liebman, and Stephen E. Stein
Quantity | Value | Units | Method | Reference | Comment |
---|---|---|---|---|---|
Tboil | 388. ± 3. | K | AVG | N/A | Average of 20 out of 21 values; Individual data points |
Quantity | Value | Units | Method | Reference | Comment |
ΔvapH° | 40.5 | kJ/mol | N/A | Ambrose, Ellender, et al., 1975 | Based on data from 280. to 452. K.; AC |
ΔvapH° | 39.79 ± 0.22 | kJ/mol | C | Seller, 1970 | ALS |
ΔvapH° | 39.8 ± 0.2 | kJ/mol | C | Seller, 1970 | AC |
Enthalpy of vaporization
ΔvapH (kJ/mol) | Temperature (K) | Method | Reference | Comment |
---|---|---|---|---|
43.4 | 315. | A | Stephenson and Malanowski, 1987 | Based on data from 300. to 387. K.; AC |
41.0 | 295. | A | Stephenson and Malanowski, 1987 | Based on data from 280. to 387. K.; AC |
36.2 | 392. | A | Stephenson and Malanowski, 1987 | Based on data from 377. to 450. K.; AC |

Condensed phase thermochemistry data

Data compiled by: Hussein Y. Afeefy, Joel F. Liebman, and Stephen E. Stein
Quantity | Value | Units | Method | Reference | Comment |
---|---|---|---|---|---|
ΔfH°liquid | -325.9 ± 0.9 | kJ/mol | Ccr | Seller, 1970 | |
Quantity | Value | Units | Method | Reference | Comment |
ΔcH°liquid | -3750.16 ± 0.88 | kJ/mol | Ccr | Seller, 1970 | Corresponding ΔfHºliquid = -325.88 kJ/mol (simple calculation by NIST; no Washburn corrections) |

Gas phase ion energetics data

Data evaluated as indicated in comments:
L - Sharon G. Lias
Data compiled as indicated in comments:
LLK - Sharon G. Lias, Rhoda D. Levin, and Sherif A. Kafafi
Quantity | Value | Units | Method | Reference | Comment |
---|---|---|---|---|---|
IE (evaluated) | 9.10 ± 0.01 | eV | N/A | N/A | L |
Ionization energy determinations
IE (eV) | Method | Reference | Comment |
---|---|---|---|
9.098 ± 0.005 | PE | Hernandez, Masclet, et al., 1977 | LLK |

References

Hu, Lu, et al., 2006
Hu, X.-F.; Lu, C.-H.; Yin, C.-S.,
Modeling Gas Chromatographic Retention Indices of Oxygen-containing Compounds by Novel Atom-type Topological Indices,
Chinese Journal of Chemical Physics, 2006, 19, 3, 243-247, https://doi.org/10.1360/cjcp2006.19(3).243.5
. [all data]
Rembold, Wallner, et al., 1989
Rembold, H.; Wallner, P.; Nitz, S.; Kollmannsberger, H.; Drawert, F.,
Volatile components of chickpea (Cicer arietinum L.) seed,
J. Agric. Food Chem., 1989, 37, 3, 659-662, https://doi.org/10.1021/jf00087a018
. [all data]
Bianchini, Tomi, et al., 2003
Bianchini, A.; Tomi, P.; Bernardini, A.F.; Morelli, I.; Flamini, G.; Cioni, P.L.; Usai, M.; Marchetti, M.,
A comparative study of volatile constituents of two Helichrysum italicum (Roth) Guss. Don Fil subspecies growing in Corsica (France), Tuscany and Sardinia (Italy),
Flavour Fragr. J., 2003, 18, 6, 487-491, https://doi.org/10.1002/ffj.1231
. [all data]
Sun and Stremple, 2003
Sun, G.; Stremple, P.,
Retention index characterization of flavor, fragrance, and many other compounds on DB-1 and DB-XLB, 2003, retrieved from http://www.chem.agilent.com/cag/cabu/pdf/b-0279.pdf. [all data]
Xu, van Stee, et al., 2003
Xu, X.; van Stee, L.L.P.; Williams, J.; Beens, J.; Adahchour, M.; Vreuls, R.J.J.; Brinkman, U.A.Th.; Lelieveld, J.,
Comprehensive two-dimensional gas chromatography (GC×GC) measurements of volatile organic compounds in the atmosphere,
Atmos. Chem. Phys., 2003, 3, 3, 665-682, https://doi.org/10.5194/acp-3-665-2003
. [all data]
Bianchini, Tomi, et al., 2001
Bianchini, A.; Tomi, P.; Costa, J.; Bernardini, A.F.,
Composition of Helichrysum italicum (Roth) G. Don fil. subsp. italicum essential oils from Corsica (France),
Flavour Fragr. J., 2001, 16, 1, 30-34, https://doi.org/10.1002/1099-1026(200101/02)16:1<30::AID-FFJ941>3.0.CO;2-F
. [all data]
Amboni, Junkes, et al., 2002
Amboni, R.D.DeM.C.; Junkes, B. daS.; Yunes, R.A.; Heinzen, V.E.F.,
Quantitative structure-property relationships study of chromatographic retention indices and normal boiling points for oxo compounds using the semi-empirical topological method,
J. Mol. Struct. (Theochem), 2002, 586, 1-3, 71-80, https://doi.org/10.1016/S0166-1280(02)00062-3
. [all data]
Zenkevich, Eliseenkov, et al., 2011
Zenkevich, I.G.; Eliseenkov, E.V.; Kasatochkin, A.N.; Zhakovskaya, Z.A.; Khoroshko, L.O.,
Gas chromatographic identification of chlorination products of aliphatic ketones,
J. Chromatogr., 2011, 1218, 21, 3291-3299, https://doi.org/10.1016/j.chroma.2010.12.056
. [all data]
Costa, De Fina, et al., 2008
Costa, R.; De Fina, M.R.; Valentino, M.R.; Rustaiyan, A.; Dugo, P.; Dugo, G.; Mondello, L.,
An investigation on the volatile composition of some Artemisia species from Iran,
Flavour Fragr. J., 2008, 24, 2, 75-82, https://doi.org/10.1002/ffj.1919
. [all data]
Feng and Mu, 2007
Feng, H.; Mu, L.-L.,
Quantitative structure-retention relationships for alkane and its derivatives based on electrotopological state index and molecular shape index,
Chem. Ind. Engineering (Chinese), 2007, 24, 2, 161-168. [all data]
Blunden, Aneja, et al., 2005
Blunden, J.; Aneja, V.P.; Lonneman, W.A.,
Characterization of non-methane volatile organic compounds at swine facilities in eastern North Carolina,
Atm. Environ., 2005, 39, 36, 6707-6718, https://doi.org/10.1016/j.atmosenv.2005.03.053
. [all data]
Junkes, Castanho, et al., 2003
Junkes, B.S.; Castanho, R.D.M.; Amboni, C.; Yunes, R.A.; Heinzen, V.E.F.,
Semiempirical Topological Index: A Novel Molecular Descriptor for Quantitative Structure-Retention Relationship Studies,
Internet Electronic Journal of Molecular Design, 2003, 2, 1, 33-49. [all data]
Estrada and Gutierrez, 1999
Estrada, E.; Gutierrez, Y.,
Modeling chromatographic parameters by a novel graph theoretical sub-structural approach,
J. Chromatogr. A, 1999, 858, 2, 187-199, https://doi.org/10.1016/S0021-9673(99)00808-0
. [all data]
Ciccioli, Cecinato, et al., 1994
Ciccioli, P.; Cecinato, A.; Brancaleoni, E.; Brachetti, A.; Frattoni, M.; Sparapani, R.,
Composition and Distribution of Polar and Non-Polar VOCs in Urban, Rural, Forest and Remote Areas,
Eur Commission EUR, 1994, 549-568. [all data]
Ciccioli, Brancaleoni, et al., 1993
Ciccioli, P.; Brancaleoni, E.; Cecinato, A.; Sparapani, R.; Frattoni, M.,
Identification and determination of biogenic and anthropogenic volatile organic compounds in forest areas of Northern and Southern Europe and a remote site of the Himalaya region by high-resolution gas chromatography-mass spectrometry,
J. Chromatogr., 1993, 643, 1-2, 55-69, https://doi.org/10.1016/0021-9673(93)80541-F
. [all data]
Girard and Lau, 1995
Girard, B.; Lau, O.L.,
Effect of maturity and storage on quality and volatile production of 'Jonagold' apples,
Food Res. Int., 1995, 28, 5, 465-471, https://doi.org/10.1016/0963-9969(96)81393-7
. [all data]
Kawakami and Kobayashi, 1991
Kawakami, M.; Kobayashi, A.,
Volatitle constituents of greem mate and roasted mate,
J. Agric. Food Chem., 1991, 39, 7, 1275-1279, https://doi.org/10.1021/jf00007a016
. [all data]
Johanningsmeier and McFeeters, 2011
Johanningsmeier, S.D.; McFeeters, R.F.,
Detection of volatile spoilage metabolites in fermented cucumbers using nontargeted, comprehensive 2-dimensional gas chromatography-time-of-flight mass spectrometry (GCxGCxTOFMS),
J. Food Sci., 2011, 76, 1, c168-c177, https://doi.org/10.1111/j.1750-3841.2010.01918.x
. [all data]
Cajka, Riddellova, et al., 2010
Cajka, T.; Riddellova, K.; Klimankova, E.; Carna, M.; Pudil, F.; Hajslova, J.,
Traceability of olive oil based on volatiles pattern and multivariante analysis,
Food Chem., 2010, 121, 1, 282-289, https://doi.org/10.1016/j.foodchem.2009.12.011
. [all data]
Peng, Yang, et al., 1991
Peng, C.T.; Yang, Z.C.; Ding, S.F.,
Prediction of rentention idexes. II. Structure-retention index relationship on polar columns,
J. Chromatogr., 1991, 586, 1, 85-112, https://doi.org/10.1016/0021-9673(91)80028-F
. [all data]