α-Chlordene

Van Den Dool and Kratz RI, non-polar column, temperature ramp

View large format table.

Column type Active phase I Reference Comment
CapillaryCP Sil 5 CB1854.Wells, Gillespie, et al., 1985120. C @ 1. min, 3. K/min; Column length: 25. m; Column diameter: 0.22 mm; Tend: 250. C

Normal alkane RI, non-polar column, temperature ramp

View large format table.

Column type Active phase I Reference Comment
CapillaryHP-11867.5Dearth and Hites, 1991H2, 50. C @ 1. min, 3. K/min; Column length: 30. m; Column diameter: 0.25 mm; Tend: 320. C
CapillaryDB-51902.4Dearth and Hites, 1991H2, 50. C @ 1. min, 3. K/min; Column length: 30. m; Column diameter: 0.25 mm; Tend: 320. C

References

Wells, Gillespie, et al., 1985
Wells, D.E.; Gillespie, M.J.; Porter, A.E.A., Dichlorobenzyl alkyl ether homologs as retention index markers and internal standards for the analysis of environmental samples using capillary gas chromatography, J. Hi. Res. Chromatogr. Chromatogr. Comm., 1985, 8, 8, 443-449, https://doi.org/10.1002/jhrc.1240080818 . [all data]

Dearth and Hites, 1991
Dearth, M.A.; Hites, R.A., Complete analysis of technical chlordane using negative ionization mass spectrometry, Environ. Sci. Technol., 1991, 25, 2, 245-254, https://doi.org/10.1021/es00014a005 . [all data]