Bicyclo[2.2.0]hexa-2,5-diene

Gas phase ion energetics data

Data compiled as indicated in comments:
LLK - Sharon G. Lias, Rhoda D. Levin, and Sherif A. Kafafi

Ionization energy determinations

IE (eV) Method Reference Comment
9.0 ± 0.1PEBieri, Burger, et al., 1977LLK
9.4 ± 0.1PEBieri, Burger, et al., 1977Vertical value; LLK
9.40PEBieri, Heilbronner, et al., 1976Vertical value; LLK
9.4PEBieri, Heibronner, et al., 1975Vertical value; LLK

References

Bieri, Burger, et al., 1977
Bieri, G.; Burger, F.; Heilbronner, E.; Maier, J.P., Valence ionization enrgies of hydrocarbons, Helv. Chim. Acta, 1977, 60, 2213. [all data]

Bieri, Heilbronner, et al., 1976
Bieri, G.; Heilbronner, E.; Kobayashi, T.; Schmelzer, A.; Goldstein, M.J.; Leight, R.S.; Lipton, M.S., 286. Dewar benzene some of its derivatives. A photoelectron spectroscopic analysis, Helv. Chim. Acta, 1976, 59, 2657. [all data]

Bieri, Heibronner, et al., 1975
Bieri, G.; Heibronner, E.; Goldstein, M.J.; Leight, R.S.; Lipton, M.S., The photoelectron spectrum of dewar benzene, Tetrahedron Lett., 1975, 8, 581. [all data]