Serine

Condensed phase thermochemistry data

Data compiled as indicated in comments:
ALS - Hussein Y. Afeefy, Joel F. Liebman, and Stephen E. Stein
DH - Eugene S. Domalski and Elizabeth D. Hearing

Quantity Value Units Method Reference Comment
Δfsolid-732.73 ± 0.28kJ/molCcbSabbah and Laffitte, 1978ALS
Quantity Value Units Method Reference Comment
Δcsolid-1448.21 ± 0.18kJ/molCcbSabbah and Laffitte, 1978ALS
Quantity Value Units Method Reference Comment
solid,1 bar149.16J/mol*KN/AHutchens, Cole, et al., 1964DH

Constant pressure heat capacity of solid

Cp,solid (J/mol*K) Temperature (K) Reference Comment
138.9298.15Sabbah and Laffitte, 1978DH
135.56298.15Hutchens, Cole, et al., 1964T = 10 to 310 K.; DH

Reaction thermochemistry data

Data compiled by: John E. Bartmess

Individual Reactions

L-Serine anion + Hydrogen cation = Serine

By formula: C3H6NO3- + H+ = C3H7NO3

Quantity Value Units Method Reference Comment
Δr1391. ± 22.kJ/molCIDCJones, Bernier, et al., 2007gas phase
Δr1392. ± 13.kJ/molG+TSO'Hair, Bowie, et al., 1992gas phase
Quantity Value Units Method Reference Comment
Δr1363. ± 13.kJ/molCIDCO'Hair, Bowie, et al., 1992gas phase

Gas phase ion energetics data

Data evaluated as indicated in comments:
HL - Edward P. Hunter and Sharon G. Lias

Data compiled as indicated in comments:
B - John E. Bartmess
MM - Michael M. Meot-Ner (Mautner)

Quantity Value Units Method Reference Comment
Proton affinity (review)914.6kJ/molN/AHunter and Lias, 1998HL
Quantity Value Units Method Reference Comment
Gas basicity880.7kJ/molN/AHunter and Lias, 1998HL

Proton affinity at 298K

Proton affinity (kJ/mol) Reference Comment
904.5 ± 4.3Bouchoux and Salpin, 2003T = 298K; MM
912.5Bojesen and Breindahl, 1994PA increased by 0.9 kcal/mol for referencing values to Hunter and Lias, 1998; MM

Gas basicity at 298K

Gas basicity (review) (kJ/mol) Reference Comment
870.6 ± 4.3Bouchoux and Salpin, 2003T = 298K; MM

De-protonation reactions

L-Serine anion + Hydrogen cation = Serine

By formula: C3H6NO3- + H+ = C3H7NO3

Quantity Value Units Method Reference Comment
Δr1391. ± 22.kJ/molCIDCJones, Bernier, et al., 2007gas phase; B
Δr1392. ± 13.kJ/molG+TSO'Hair, Bowie, et al., 1992gas phase; B
Quantity Value Units Method Reference Comment
Δr1363. ± 13.kJ/molCIDCO'Hair, Bowie, et al., 1992gas phase; B

References

Sabbah and Laffitte, 1978
Sabbah, R.; Laffitte, M., Enthalpy of formation of L-serine in the solid state, Thermochim. Acta, 1978, 23, 192-195. [all data]

Hutchens, Cole, et al., 1964
Hutchens, J.O.; Cole, A.G.; Stout, J.W., Heat capacities from 11 to 305 K, entropies, enthalpy, and free energy of formation of L-serine, J. Biol. Chem., 1964, 239, 4194-4195. [all data]

Jones, Bernier, et al., 2007
Jones, C.M.; Bernier, M.; Carson, E.; Colyer, K.E.; Metz, R.; Pawlow, A.; Wischow, E.D.; Webb, I.; Andriole, E.J.; Poutsma, J.C., Gas-phase Acities of the 20 Protein Amino Acids, Int. J. Mass Spectrom., 2007, 267, 1-3, 54-62, https://doi.org/10.1016/j.ijms.2007.02.018 . [all data]

O'Hair, Bowie, et al., 1992
O'Hair, R.J.; Bowie, J.H.; Gronert, S., Gas Phase Acidity of the alpha-Amino Acids, Int. J. Mass Spectrom. Ion Proc., 1992, 117, 23, https://doi.org/10.1016/0168-1176(92)80083-D . [all data]

Hunter and Lias, 1998
Hunter, E.P.; Lias, S.G., Evaluated Gas Phase Basicities and Proton Affinities of Molecules: An Update, J. Phys. Chem. Ref. Data, 1998, 27, 3, 413-656, https://doi.org/10.1063/1.556018 . [all data]

Bouchoux and Salpin, 2003
Bouchoux, G.; Salpin, J.Y., Gas-phase basicity of glycine, alanine, proline, serine, lysine, histidine and some of their peptides by the thermokinetic method, European J. Mass Spectrometry, 2003, 9, 391-402. [all data]

Bojesen and Breindahl, 1994
Bojesen, G.; Breindahl, T., On the Proton Affinity od Some Alpha-Amino Acids and the Theory of the Kinetic Method., J. Chem. Soc. Perkin 2, 1994, 1029. [all data]