Dimagnesium tetrafluoride

Gas phase ion energetics data

Data compiled by: Henry M. Rosenstock, Keith Draxl, Bruce W. Steiner, and John T. Herron

Appearance energy determinations

Ion AE (eV) Other Products MethodReferenceComment
Mg2F3+14.0 ± 0.5FEIBerkowitz and Marquart, 1962

References

Berkowitz and Marquart, 1962
Berkowitz, J.; Marquart, J.R., Mass-spectrometric study of the magnesium halides, J. Chem. Phys., 1962, 37, 1853. [all data]