Propanamide, 2-methyl-

Phase change data

Data compiled as indicated in comments:
BS - Robert L. Brown and Stephen E. Stein
ALS - Hussein Y. Afeefy, Joel F. Liebman, and Stephen E. Stein
AC - William E. Acree, Jr., James S. Chickos
DH - Eugene S. Domalski and Elizabeth D. Hearing

Quantity Value Units Method Reference Comment
Tboil491.2KN/AAldrich Chemical Company Inc., 1990BS
Quantity Value Units Method Reference Comment
Δsub86.0 ± 0.2kJ/molVAbboud, Jimenez, et al., 1989ALS
Δsub86.0 ± 0.2kJ/molN/AAbboud, Jimenez, et al., 1989AC

Enthalpy of sublimation

ΔsubH (kJ/mol) Temperature (K) Method Reference Comment
86.000298.15N/AAbboud, Jimenez, et al., 1989DH
86.1 ± 0.2294.MEAbboud, Jimenez, et al., 1989Based on data from 285. - 302. K.; AC

Entropy of sublimation

ΔsubS (J/mol*K) Temperature (K) Reference Comment
288.4298.15Abboud, Jimenez, et al., 1989DH

Enthalpy of fusion

ΔfusH (kJ/mol) Temperature (K) Reference Comment
19.2400.1Abate, Badea, et al., 2008AC

Gas phase thermochemistry data

Data compiled by: Hussein Y. Afeefy, Joel F. Liebman, and Stephen E. Stein

Quantity Value Units Method Reference Comment
Δfgas-282.6 ± 0.9kJ/molCcbAbboud, Jimenez, et al., 1989

Condensed phase thermochemistry data

Data compiled as indicated in comments:
ALS - Hussein Y. Afeefy, Joel F. Liebman, and Stephen E. Stein
DH - Eugene S. Domalski and Elizabeth D. Hearing

Quantity Value Units Method Reference Comment
Δfsolid-88.1 ± 0.2kcal/molCcbAbboud, Jimenez, et al., 1989ALS
Quantity Value Units Method Reference Comment
Δcsolid-595.5 ± 0.1kcal/molCcbAbboud, Jimenez, et al., 1989ALS

Constant pressure heat capacity of solid

Cp,solid (cal/mol*K) Temperature (K) Reference Comment
35.40298.15Abboud, Jimenez, et al., 1989One temperature; Cp given as 1.70 J/g*K.; DH

References

Aldrich Chemical Company Inc., 1990
Aldrich Chemical Company Inc., Catalog Handbook of Fine Chemicals, Aldrich Chemical Company, Inc., Milwaukee WI, 1990, 1. [all data]

Abboud, Jimenez, et al., 1989
Abboud, J.-L.M.; Jimenez, P.; Roux, M.V.; Turrion, C.; Lopez-Mardomingo, C., Structural effects on the thermochemical properties of carbonyl compounds. I. Enthalpies of combustion, vapour pressures and enthalpies of sublimation, and enthalpies of formation of 2-methylpropanamide, 2,2-dimethylpropanamide, and 1-adamantyl carboxamide, J. Chem. Thermodyn., 1989, 21, 859-865. [all data]

Abate, Badea, et al., 2008
Abate, Lorenzo; Badea, Elena; Blanco, Ignazio; Della Gatta, Giuseppe, Heat Capacities and Enthalpies of Solid-Solid Transitions and Fusion of a Series of Eleven Primary Alkylamides by Differential Scanning Calorimetry, J. Chem. Eng. Data, 2008, 53, 4, 959-965, https://doi.org/10.1021/je700662a . [all data]