1,3-Dichlorohexane

Reaction thermochemistry data

Data compiled by: Hussein Y. Afeefy, Joel F. Liebman, and Stephen E. Stein

Individual Reactions

1,3-Dichlorohexane = 1,4-Dichlorohexane

By formula: C6H12Cl2 = C6H12Cl2

Quantity Value Units Method Reference Comment
Δr-2.2 ± 0.1kJ/molEqkRozhnov, Cherkasova, et al., 1975liquid phase

References

Rozhnov, Cherkasova, et al., 1975
Rozhnov, A.M.; Cherkasova, R.I.; Sharonov, K.G., Equilibrium of isomerization of 1,3-; 1,4-; 1,5-dichlorohexanes and heats of formation of dichloroalkanes, Zh. Fiz. Khim., 1975, 49, 1338. [all data]