n-Dodecylcyclopentane

Phase change data

Data compiled as indicated in comments:
TRC - Thermodynamics Research Center, NIST Boulder Laboratories, Chris Muzny director
AC - William E. Acree, Jr., James S. Chickos

Quantity Value Units Method Reference Comment
Tfus265.7KN/ASchmidt, 1942Uncertainty assigned by TRC = 0.5 K; TRC
Tfus265.7KN/ASchmidt and Gemassmer, 1940Uncertainty assigned by TRC = 1. K; TRC
Quantity Value Units Method Reference Comment
Δvap20.4kcal/molN/AReid, 1972AC

Enthalpy of vaporization

ΔvapH (kcal/mol) Temperature (K) Reference Comment
16.3465.Dykyj, Svoboda, et al., 1999Based on data from 450. - 619. K.; AC

In addition to the Thermodynamics Research Center (TRC) data available from this site, much more physical and chemical property data is available from the following TRC products:

References

Schmidt, 1942
Schmidt, A.W., Physical properties of aliphatic compounds, Ber. Dtsch. Chem. Ges. B, 1942, 75, 1399. [all data]

Schmidt and Gemassmer, 1940
Schmidt, A.W.; Gemassmer, A., Physical data of monoalkylcyclopentanes ???., Ber. Dtsch. Chem. Ges. B, 1940, 73, 359-66. [all data]

Reid, 1972
Reid, Robert C., Handbook on vapor pressure and heats of vaporization of hydrocarbons and related compounds, R. C. Wilhort and B. J. Zwolinski, Texas A Research Foundation. College Station, Texas(1971). 329 pages.$10.00, AIChE J., 1972, 18, 6, 1278-1278, https://doi.org/10.1002/aic.690180637 . [all data]

Dykyj, Svoboda, et al., 1999
Dykyj, J.; Svoboda, J.; Wilhoit, R.C.; Frenkel, M.L.; Hall, K.R., Vapor Pressure of Chemicals: Part A. Vapor Pressure and Antoine Constants for Hydrocarbons and Sulfur, Selenium, Tellurium and Hydrogen Containing Organic Compounds, Springer, Berlin, 1999, 373. [all data]