Ethion

Van Den Dool and Kratz RI, non-polar column, temperature ramp

Data compiled by: NIST Mass Spectrometry Data Center, William E. Wallace, director

Column type Capillary
Active phase OV-1
Column length (m) 25.
Carrier gas H2
Substrate
Column diameter (mm) 0.25
Phase thickness (μm) 0.3
Tstart (C) 160.
Tend (C) 260.
Heat rate (K/min) 5.
Initial hold (min) 1.
Final hold (min) 2.
I 2223.
ReferenceBicchi, D'Amato, et al., 1996
Comment MSDC-RI

Kovats' RI, non-polar column, isothermal

Data compiled by: NIST Mass Spectrometry Data Center, William E. Wallace, director

Column type Capillary
Active phase SPB-1
Column length (m) 25.
Carrier gas He
Substrate
Column diameter (mm) 0.20
Phase thickness (μm)
Temperature (C) 250.
I 2265.
ReferenceLora-Tamayo, Rams, et al., 1986
Comment MSDC-RI

Normal alkane RI, non-polar column, isothermal

Data compiled by: NIST Mass Spectrometry Data Center, William E. Wallace, director

Column type Packed
Active phase OV-1
Column length (m) 1.
Carrier gas Helium
Substrate Chromosorb W AW DMCS
Column diameter (mm)
Phase thickness (μm)
Temperature (C) 190.
I 2220.
ReferenceTSunoda, 1986
Comment MSDC-RI

Normal alkane RI, non-polar column, custom temperature program

Data compiled by: NIST Mass Spectrometry Data Center, William E. Wallace, director

Column type CapillaryCapillaryCapillaryCapillaryOther
Active phase 5 % Phenyl methyl siloxane5 % Phenyl methyl siloxaneUltra-1OV-1, SE-30, Methyl silicone, SP-2100, OV-101, DB-1, etc.Methyl Silicone
Column length (m) 30.30. 50.
Carrier gas HeliumHelium Hydrogen
Substrate
Column diameter (mm) 0.250.25 0.32
Phase thickness (μm) 0.250.25
Program 50 0C(1 min) 25 0C/min -> 125 0C 10 0C/min -> 300 0C (10 min)50 0C(1 min) 25 0C/min -> 125 0C 10 0C/min -> 300 0C (10 min)not specifiednot specifiednot specified
I 2281.2279.2210.2265.2220.
ReferenceDepartment of Food Safety and Welfare, 2006Department of Food Safety and Welfare, 2006Tameo and Kiyos, 1991Waggott and Davies, 1984Ardrey and Moffat, 1981
Comment MSDC-RI MSDC-RI MSDC-RI MSDC-RI MSDC-RI

Kovats' RI, non-polar column, custom temperature program

Data compiled by: NIST Mass Spectrometry Data Center, William E. Wallace, director

Column type Packed
Active phase SE-30
Column length (m) 1.5
Carrier gas He
Substrate Chromosorb G HP (80-100 mesh)
Column diameter (mm)
Phase thickness (μm)
Program not specified
I 2220.
ReferenceRamsey, Lee, et al., 1980
Comment MSDC-RI

References

Bicchi, D'Amato, et al., 1996
Bicchi, C.; D'Amato, A.; Binello, A., Identification of pesticide residues in real matrices by combining retention indices and specific multidetection responses, J. Hi. Res. Chromatogr., 1996, 19, 2, 80-84, https://doi.org/10.1002/jhrc.1240190204 . [all data]