Tibolone

Phase change data

Data compiled by: William E. Acree, Jr., James S. Chickos

Enthalpy of fusion

ΔfusH (kcal/mol) Temperature (K) Method Reference Comment
7.12444.2DSCde Araujo, de Faria, et al., 2010Based on data from monoclinic K.

References

de Araujo, de Faria, et al., 2010
de Araujo, Gabriel Lima Barros; de Faria, Dalva Lucia Araujo; Zaim, Márcio Henrique; de Souza Carvalho, Flávio Machado; de Andrade, Fabio Ramos Dias; Matos, Jivaldo do Rosario, Thermal studies on polymorphic structures of tibolone, J Therm Anal Calorim, 2010, 102, 1, 233-241, https://doi.org/10.1007/s10973-009-0580-8 . [all data]