Hexobarbital

Kovats' RI, non-polar column, temperature ramp

Data compiled by: NIST Mass Spectrometry Data Center, William E. Wallace, director

Column type PackedCapillaryCapillary
Active phase SE-30SE-30SE-30
Column length (m)  12.25.
Carrier gas N2He
Substrate
Column diameter (mm)  0.220.49
Phase thickness (μm)  0.451.14
Tstart (C) 100.120.100.
Tend (C) 310.300.275.
Heat rate (K/min) 30.8.8.
Initial hold (min) 3.2.2.
Final hold (min) 5.12.15.
I 1855.1843.1841.
ReferenceMaurer, 1990Schepers, Wijsbeek, et al., 1982Schepers, Wijsbeek, et al., 1982
Comment MSDC-RI MSDC-RI MSDC-RI

References

Maurer, 1990
Maurer, H.H., Identification and differentiation of barbiturates, other sedative-hypnotics and their metabolites in urine integrated in a general screening procedure using computerized gas chromatography-mass spectrometry, J. Chromatogr., 1990, 530, 307-326, https://doi.org/10.1016/S0378-4347(00)82334-8 . [all data]

Schepers, Wijsbeek, et al., 1982
Schepers, P.; Wijsbeek, J.; Franke, J.P.; de Zeeuw, R.A., Applicability of capillary gas chromatography to substance identification in toxicology by means of retention indices, J. Forensic Sci., 1982, 27, 1, 49-60. [all data]