2,3-Butanediol monoacetate

Kovats' RI, non-polar column, custom temperature program

View large format table.

Column type Active phase I Reference Comment
CapillarySE-30986.Brander, Kepner, et al., 1980Column length: 80. m; Column diameter: 0.29 mm; Program: not specified
CapillarySE-30988.Brander, Kepner, et al., 1980Column length: 80. m; Column diameter: 0.29 mm; Program: not specified

Van Den Dool and Kratz RI, polar column, temperature ramp

View large format table.

Column type Active phase I Reference Comment
CapillaryDB-FFAP1573.Charles, Martin, et al., 200030. m/0.32 mm/0.25 μm, H2, 40. C @ 2. min, 5. K/min; Tend: 240. C
CapillaryDB-FFAP1587.Charles, Martin, et al., 200030. m/0.32 mm/0.25 μm, H2, 40. C @ 2. min, 5. K/min; Tend: 240. C

Normal alkane RI, polar column, temperature ramp

View large format table.

Column type Active phase I Reference Comment
CapillaryDB-Wax1560.Hayata, Sakamoto, et al., 200260. m/0.25 mm/0.25 μm, He, 40. C @ 10. min, 3. K/min, 220. C @ 10. min
CapillaryDB-Wax1572.Hayata, Sakamoto, et al., 200260. m/0.25 mm/0.25 μm, He, 40. C @ 10. min, 3. K/min, 220. C @ 10. min

References

Brander, Kepner, et al., 1980
Brander, C.F.; Kepner, R.E.; Webb, A.D., Identification of Some Volatile Compounds of Wine of Vitis Vinifera Cultivar Pinot Noir, Am. J. Enol. Vitic, 1980, 31, 1, 69-75. [all data]

Charles, Martin, et al., 2000
Charles, M.; Martin, B.; Ginies, C.; Etievant, P.; Coste, G.; Guichard, E., Potent aroma compounds of two red wine vinegars, J. Agric. Food Chem., 2000, 48, 1, 70-77, https://doi.org/10.1021/jf9905424 . [all data]

Hayata, Sakamoto, et al., 2002
Hayata, Y.; Sakamoto, T.; Kozuka, H.; Sakamoto, K.; Osajima, Y., Analysis of aromatic volatile compounds in 'Miyabi' melon (Cucumis melo L.) using the Porapak Q column, J. Jpn. Soc. Hortic. Sci., 2002, 71, 4, 517-525, https://doi.org/10.2503/jjshs.71.517 . [all data]