Ethyl palmitoleate

Normal alkane RI, non-polar column, custom temperature program

Data compiled by: NIST Mass Spectrometry Data Center, William E. Wallace, director

Column type Capillary
Active phase HP-5
Column length (m) 30.
Carrier gas Helium
Substrate
Column diameter (mm) 0.32
Phase thickness (μm) 0.25
Program 60 0C (3 min) 10 0C/min -> 280 0C (1 min) 3 0C/min -> 320 0C (20 min)
I 1976.
ReferencePovolo, Pelizzola, et al., 2009
Comment MSDC-RI

References

Povolo, Pelizzola, et al., 2009
Povolo, M.; Pelizzola, V.; Ravera, D.; Contarini, G., Significance of the nonvolatile minor compounds of the neutral lipid fraction as markers of the origin of dairy products, J. Agric. Food Chem., 2009, 57, 16, 7387-7394, https://doi.org/10.1021/jf8040353 . [all data]