1,4-Methanonaphthalene-6-carboxylic acid ethyl ester,1,4-dihydro-

Gas phase ion energetics data

Data compiled by: Sharon G. Lias, Rhoda D. Levin, and Sherif A. Kafafi

Ionization energy determinations

IE (eV) Method Reference Comment
8.51 ± 0.05PESantiago, McAlduff, et al., 1978Vertical value

References

Santiago, McAlduff, et al., 1978
Santiago, C.; McAlduff, E.J.; Houk, K.N.; Snow, R.A.; Paquette, L.A., Photoelectron spectra of ortho- and meta-substituted benzonorbornadienes. Relationships to regioselectivities in triplet di-π-methane rearrangements, J. Am. Chem. Soc., 1978, 100, 6149. [all data]