methylenecyclononane

Phase change data

Data compiled by: Thermodynamics Research Center, NIST Boulder Laboratories, Chris Muzny director

Quantity Value Units Method Reference Comment
Tboil442.KN/ASorm and Beranek, 1953Uncertainty assigned by TRC = 1. K

In addition to the Thermodynamics Research Center (TRC) data available from this site, much more physical and chemical property data is available from the following TRC products:

References

Sorm and Beranek, 1953
Sorm, F.; Beranek, J., Synthesis of methylenecycloalkanes, Chem. Listy, 1953, 47, 708. [all data]