Diacetylmorphine

Van Den Dool and Kratz RI, non-polar column, temperature ramp

Data compiled by: NIST Mass Spectrometry Data Center, William E. Wallace, director

Column type CapillaryCapillaryCapillaryCapillaryPacked
Active phase DB-1Methyl SiliconeDB-1SE-30SE-30
Column length (m) 15.12.15.15.1.8
Carrier gas HeHeHeHeN2
Substrate     Chromosorb W
Column diameter (mm) 0.320.20.250.25
Phase thickness (μm) 0.250.330.250.25
Tstart (C) 120.50.120.100.130.
Tend (C) 280.300.280.295.290.
Heat rate (K/min) 8.20.8.5.8.
Initial hold (min)  1.  2.
Final hold (min) 5.3.5. 8.
I 2602.2605.02602.2581.2620.
ReferencePerrigo, Peel, et al., 1985Newton and Foery, 1984Perrigo, Ballantyne, et al., 1984Anderson and Stafford, 1983Perrigo and Peel, 1981
Comment MSDC-RI MSDC-RI MSDC-RI MSDC-RI MSDC-RI

Kovats' RI, non-polar column, isothermal

View large format table.

Column type Active phase Temperature (C) I Reference Comment
PackedSE-30240.2607.Musumarra, Scarlata, et al., 1987N2, 1% se-30 on Anachrom ABS(80-100mesh); Column length: 2. m
CapillarySPB-1250.2639.Lora-Tamayo, Rams, et al., 1986He; Column length: 25. m; Column diameter: 0.20 mm
PackedSE-30220.2607.Mari, Bertol, et al., 1984Anakrom ABS; Column length: 2. m
PackedSE-30260.2643.Mari, Bertol, et al., 1984Anakrom ABS; Column length: 2. m
PackedOV-1250.2638.Machata and Vycudilik, 1980N2, Chromosorb G
PackedOV-1250.2630.Berninger and Möller, 1977

Kovats' RI, non-polar column, temperature ramp

View large format table.

Column type Active phase I Reference Comment
CapillarySE-302630.Schepers, Wijsbeek, et al., 198225. m/0.49 mm/1.14 μm, 100. C @ 2. min, 8. K/min, 275. C @ 15. min

Kovats' RI, non-polar column, custom temperature program

View large format table.

Column type Active phase I Reference Comment
PackedOV-1012600.McLinden and Stenhouse, 1979N2, Chromosorb W; Column length: 2. m; Program: not specified
PackedOV-12660.Berninger, Grunnagel, et al., 1975N2, Chromosorb G, AW-DMCS; Column length: 2. m; Program: not specified
PackedOV-12655.Berninger, Grunnagel, et al., 1975N2, Chromosorb G, AW-DMCS; Column length: 2. m; Program: not specified
PackedSE-302615.Moffat, Stead, et al., 1974Column length: 2. m; Program: not specified

Van Den Dool and Kratz RI, non-polar column, custom temperature program

View large format table.

Column type Active phase I Reference Comment
CapillaryCP Sil 5 CB2635.Aderjan and Bogusz, 198810. m/0.53 mm/5.0 μm, He; Program: 100 0C (2 min ) 15 0C/min -> 200 0C 10 0C/min -> 300 0C (8 min hold)
CapillaryCP Sil 5 CB2614.Aderjan and Bogusz, 198810. m/0.53 mm/5.0 μm, He; Program: not specified
CapillaryBP-12607.Stowell and Wilson, 198712. m/0.22 mm/0.25 μm, He; Program: 120C => 8C/min => 270C => 25C/min => 300C

Normal alkane RI, non-polar column, isothermal

View large format table.

Column type Active phase Temperature (C) I Reference Comment
CapillaryOV-1240.2598.Medina III, 198925. m/0.25 mm/0.20 μm, Helium

Normal alkane RI, non-polar column, temperature ramp

View large format table.

Column type Active phase I Reference Comment
PackedSE-302614.MHA, 9999Nitrogen, Chromosorb G AW DMCS (80-100 mesh); Column length: 2. m; Tstart: 100. C; Tend: 300. C
CapillaryPolymethylsiloxane, (PMS-20000)2615.Gambaro, Saligari, et al., 199712. m/0.20 mm/0.33 μm, He, 10. K/min; Tstart: 160. C; Tend: 300. C
CapillaryBP-12581.Stowell and Wilson, 198512. m/0.22 mm/0.25 μm, He, 5. K/min; Tstart: 100. C; Tend: 295. C
CapillaryBP-12605.Stowell and Wilson, 198512. m/0.22 mm/0.25 μm, He, 8. K/min; Tstart: 120. C; Tend: 280. C
CapillaryBP-12605.Stowell and Wilson, 198512. m/0.22 mm/0.25 μm, He, 20. K/min; Tstart: 50. C; Tend: 300. C
PackedOV-12590.Marozzi, Gambaro, et al., 1982Gas Chrom P, 5. K/min; Column length: 2. m; Tstart: 150. C; Tend: 300. C
PackedSE-302635.Marozzi, Gambaro, et al., 1982Gas Chrom P, 5. K/min; Column length: 2. m; Tstart: 150. C; Tend: 300. C
PackedSE-302620.Peel and Perrigo, 1976Nitrogen, Chromosorb W AW DMS (80-100 mesh), 130. C @ 2. min, 8. K/min, 290. C @ 8. min; Column length: 2. m
PackedSE-302620.Peel and Perrigo, 1975N2, Chromosorb W AW DMS, 130. C @ 2. min, 8. K/min, 290. C @ 8. min; Column length: 2. m

Normal alkane RI, non-polar column, custom temperature program

View large format table.

Column type Active phase I Reference Comment
CapillaryPolymethylsiloxane, (PMS-20000)2625.Gambaro, Saligari, et al., 199712. m/0.20 mm/0.33 μm, He; Program: not specified
CapillaryBP-12607.Stowell and Wilson, 198512. m/0.22 mm/0.25 μm, He; Program: 120 0X 8 0C/min -> 270 0C 25 0C/min -> 300 0C (5 min)
CapillaryBP-12608.Stowell and Wilson, 198512. m/0.22 mm/0.25 μm, He; Program: 120 0X 8 0C/min -> 270 0C 25 0C/min -> 300 0C (5 min)
CapillaryBP-12611.Stowell and Wilson, 198512. m/0.22 mm/0.25 μm, He; Program: 120 0X 8 0C/min -> 270 0C 25 0C/min -> 300 0C (5 min)
CapillaryBP-12607.Stowell and Wilson, 198512. m/0.22 mm/0.25 μm, He; Program: not specified
CapillaryBP-12607.Stowell and Wilson, 198512. m/0.22 mm/0.25 μm, He; Program: not specified
CapillaryBP-12609.Stowell and Wilson, 198512. m/0.22 mm/0.25 μm, He; Program: not specified
CapillaryBP-12611.Stowell and Wilson, 198512. m/0.22 mm/0.25 μm, He; Program: not specified
CapillaryBP-12607.Stowell and Wilson, 198512. m/0.22 mm/0.25 μm, He; Program: 120 0X 8 0C/min -> 270 0C 25 0C/min -> 300 0C (5 min)
CapillaryBP-12615.Stowell and Wilson, 198512. m/0.22 mm/0.25 μm, He; Program: not specified
CapillaryOV-1, SE-30, Methyl silicone, SP-2100, OV-101, DB-1, etc.2581.Waggott and Davies, 1984Hydrogen; Column length: 50. m; Column diameter: 0.32 mm; Program: not specified
CapillaryOV-1, SE-30, Methyl silicone, SP-2100, OV-101, DB-1, etc.2639.Waggott and Davies, 1984Hydrogen; Column length: 50. m; Column diameter: 0.32 mm; Program: not specified
OtherMethyl Silicone2614.Ardrey and Moffat, 1981Program: not specified

References

Perrigo, Peel, et al., 1985
Perrigo, B.J.; Peel, H.W.; Ballantyne, D.J., Use of Dual-Column Fused-Silica Capillary Gas Chromatography in Combination with Detector Response Factors for Analytical Toxicology., J. Chromatogr., 1985, 341, 81-88, https://doi.org/10.1016/S0378-4347(00)84011-6 . [all data]

Newton and Foery, 1984
Newton, B.; Foery, R.F., Retention indices and dual capillary gas chromatography for rapid identification of sedative hypnotic drugs in emergency toxicology, J. Anal. Toxicol., 1984, 8, 3, 129-134, https://doi.org/10.1093/jat/8.3.129 . [all data]

Perrigo, Ballantyne, et al., 1984
Perrigo, B.J.; Ballantyne, D.J.; Peel, H.W., Condierations in developing a data base for drugs on a DBI capillary column, J. Can. Soc. Forensic Sci., 1984, 17, 2, 41-49, https://doi.org/10.1080/00085030.1984.10757360 . [all data]

Anderson and Stafford, 1983
Anderson, W.H.; Stafford, D.T., Applications of capillary gas chromatography in routine toxicological analyses, J. Hi. Res. Chromatogr. Chromatogr. Comm., 1983, 6, 5, 247-254, https://doi.org/10.1002/jhrc.1240060506 . [all data]

Perrigo and Peel, 1981
Perrigo, B.J.; Peel, H.W., The use of retention indices and temperature-programmed gas chromatography in analytical toxicology, J. Chromatogr. Sci., 1981, 19, 5, 219-226, https://doi.org/10.1093/chromsci/19.5.219 . [all data]