5-Hydroxytryptophol, 3TMS derivative

Van Den Dool and Kratz RI, non-polar column, temperature ramp

View large format table.

Column type Active phase I Reference Comment
PackedOV-12156.Butts, 1972He, Chromosorb W HP (80-100 mesh), 10. K/min; Column length: 2. m; Tstart: 100. C; Tend: 325. C

Normal alkane RI, non-polar column, temperature ramp

View large format table.

Column type Active phase I Reference Comment
PackedOV-12155.Francis, Smith, et al., 1980He, 10. K/min; Column length: 1.5 m; Tstart: 180. C; Tend: 320. C

References

Butts, 1972
Butts, W.C., Two-Column Gas Chromatography of Trimethylsilyl Derivatives of Biochemically Significant Compounds, Anal. Biochemistry, 1972, 46, 1, 187-199, https://doi.org/10.1016/0003-2697(72)90411-3 . [all data]

Francis, Smith, et al., 1980
Francis, P.; Smith, I.; Finnie, M.D.A., Mass spectrometric and chromatographic characteristics of neutral and acidic 5-methoxyindoles and some related compounds, Biomed. Mass Spectrom., 1980, 7, 7, 294-300, https://doi.org/10.1002/bms.1200070706 . [all data]