bis(undecylammonium) tetrachlorocobaltate(II)

Phase change data

Data compiled by: Thermodynamics Research Center, NIST Boulder Laboratories, Chris Muzny director

Quantity Value Units Method Reference Comment
Tfus437.KN/ALandi and Vacatello, 1975Crystal phase 1 phase; Uncertainty assigned by TRC = 1. K

In addition to the Thermodynamics Research Center (TRC) data available from this site, much more physical and chemical property data is available from the following TRC products:

References

Landi and Vacatello, 1975
Landi, E.; Vacatello, M., New disordered polymorphs in long chain alkylammonium tetrachlorocobaltates, Thermochim. Acta, 1975, 12, 141. [all data]